{"text_format":"1","workbook":"xlsx","n_sheets":5,"sheets":["Anasayfa","Değerlendirme Formu","Öğrenci Listeleri","Seçilen Öğretmen","Kaynaklarımız"],"not_rendered":{"charts":0,"images":6,"macros":1,"external_links":0,"defined_names":13,"comments":1,"pivot_tables":0},"unopened":[],"bounds":{"document_bytes":16777216,"sheet_cells":100000,"rows_first":2000,"rows_last":500,"rows_between":2000,"halvings":0,"cell_chars":16384,"cell_head_chars":4096},"cells_cut":0,"cells_raw":0,"read":"whole","date_system":"1900"}

{"sheet":"Anasayfa","index":0,"n_rows":13,"n_cols":9,"rows_kept":13,"cut":false,"hidden":false,"merged":[[12,1,12,5],[12,7,14,8],[1,1,1,2],[2,1,2,2],[3,1,3,2],[9,1,9,5],[10,1,10,5],[11,1,11,5]]}
[]
[null,"SARAY ŞEHİT MURAT DİLMAÇ ANADOLU İMAM HATİP LİSESİ",null,null,null,null,null,"DEĞERLENDİRME KRİTERLERİ","PUAN DEĞERİ"]
[null,"PROJE ÇALIŞMASI DEĞERLENDİRME FORMU",null,null,null,null,null,"Projenin Tamamlanması",10]
[null,null,null,null,null,null,null,"Rapor (Yazı Güzelliği)",8]
[null,"ÖĞRETMEN ADI","EBRU BUSE GÜDER",null,null,null,null,"Düzen ve Temizlik",9]
[null,"BRANŞI",{"$f":"VLOOKUP(C5,Kaynaklarımız!$C$3:$D$28,2,0)","v":"İNGİLİZCE"},null,null,null,null,"Projenin Doğruluk Derecesi",7]
[null,"EĞİTİM-ÖĞRETİM YILI","2017-2018",null,null,null,null,"Harcanan zaman ve emek",11]
[null,null,null,null,null,null,null,"Proje Anlaşılmış",5]
[null,null,null,null,null,null,null,"Proje ilgili sorulara yanıt verir",11]
[null,"SAYFA KORUMA ŞİFRESİ : -",null,null,null,null,null,"Proje zamanında teslim edildi",12]
[null,"* ÖĞRETMEN, YIL SEÇİMLERİ, DEĞERLENDİRME KRİTERLERİ VE PUANLARI BU SAYFADAN YAPILACAKTIR.",null,null,null,null,null,"Kaynak Kullanımı",13]
[null,"* PROJE ALAN ÖĞRENCİ LİSTELERİ GÜNCEL DURUMA GÖRE YAPILMIŞTIR. EKSİKLİK VEYA HATA VARSA ÖĞRENCİ LİSTELERİ SAYFASINDAN KENDİ BÖLÜMÜNÜZE GİDEREK GÜNCELLEME YAPABİLİRSİNİZ.",null,null,null,null,null,"Sunum",14]
[null,"* DEĞERLENDİRME FORMU SAYFASINDA SADECE PUANLARI YAZACAKSINIZ, DİĞER BÖLÜMLER KENDİLİĞİNDEN GÜNCELLENECEKTİR.",null,null,null,null,null," DEĞERLENDİRME KRİTERLERİ ZÜMREDE BELİRTİLEN KRİTERLE DEĞİŞTİRİLECEKTİR. EN FAZLA 10 DEĞERLENDİRME KRİTERİ YAZABİLİRSİNİZ."]

{"sheet":"Değerlendirme Formu","index":1,"n_rows":53,"n_cols":28,"rows_kept":53,"cut":false,"hidden":false,"merged":[[2,2,2,17],[48,2,48,17],[47,2,47,5],[1,2,1,17],[3,2,3,6],[4,2,4,6],[5,7,5,17],[47,6,47,15],[47,16,47,17],[49,11,49,17],[52,9,52,10],[52,4,52,6],[52,7,52,8],[51,9,51,10],[51,4,51,6],[51,7,51,8],[51,11,51,17],[52,11,52,17]]}
[]
[null,null,{"$f":"Anasayfa!B2","v":"SARAY ŞEHİT MURAT DİLMAÇ ANADOLU İMAM HATİP LİSESİ"}]
[null,null,{"$f":"Anasayfa!C7&\" \"&\"EĞİTİM-ÖĞRETİM YILI PROJE DEĞERLENDİRME FORMU\"","v":"2017-2018 EĞİTİM-ÖĞRETİM YILI PROJE DEĞERLENDİRME FORMU"},null,null,null,null,null,null,null,null,null,null,null,null,null,null,null,null,null,null,null,2,{"$f":"AVERAGE(U3,V3,W3)","v":2},{"$f":"IF(V3>0,V3,0)","v":0}]
[null,null,"ÖLÇÜTLER",null,null,null,null,{"$f":"IF(Anasayfa!H3=0,\" \",Anasayfa!H3)","v":"Projenin Tamamlanması"},{"$f":"IF(Anasayfa!H4=0,\" \",Anasayfa!H4)","v":"Rapor (Yazı Güzelliği)"},{"$f":"IF(Anasayfa!H5=0,\" \",Anasayfa!H5)","v":"Düzen ve Temizlik"},{"$f":"IF(Anasayfa!H6=0,\" \",Anasayfa!H6)","v":"Projenin Doğruluk Derecesi"},{"$f":"IF(Anasayfa!H7=0,\" \",Anasayfa!H7)","v":"Harcanan zaman ve emek"},{"$f":"IF(Anasayfa!H8=0,\" \",Anasayfa!H8)","v":"Proje Anlaşılmış"},{"$f":"IF(Anasayfa!H9=0,\" \",Anasayfa!H9)","v":"Proje ilgili sorulara yanıt verir"},{"$f":"IF(Anasayfa!H10=0,\" \",Anasayfa!H10)","v":"Proje zamanında teslim edildi"},{"$f":"IF(Anasayfa!H11=0,\" \",Anasayfa!H11)","v":"Kaynak Kullanımı"},{"$f":"IF(Anasayfa!H12=0,\" \",Anasayfa!H12)","v":"Sunum"},"TOPLAM"]
[null,null,"Ölçütlerin Puan Değerleri",null,null,null,null,{"$f":"IF(Anasayfa!I3=0,\" \",Anasayfa!I3)","v":10},{"$f":"IF(Anasayfa!I4=0,\" \",Anasayfa!I4)","v":8},{"$f":"IF(Anasayfa!I5=0,\" \",Anasayfa!I5)","v":9},{"$f":"IF(Anasayfa!I6=0,\" \",Anasayfa!I6)","v":7},{"$f":"IF(Anasayfa!I7=0,\" \",Anasayfa!I7)","v":11},{"$f":"IF(Anasayfa!I8=0,\" \",Anasayfa!I8)","v":5},{"$f":"IF(Anasayfa!I9=0,\" \",Anasayfa!I9)","v":11},{"$f":"IF(Anasayfa!I10=0,\" \",Anasayfa!I10)","v":12},{"$f":"IF(Anasayfa!I11=0,\" \",Anasayfa!I11)","v":13},{"$f":"IF(Anasayfa!I12=0,\" \",Anasayfa!I12)","v":14},{"$f":"SUM(H5:Q5)","v":100}]
[null,null,"SIRA","DERS","SINIFI","NO","ADI SOYADI","SARAY ŞEHİT MURAT DİLMAÇ ANADOLU İMAM HATİP LİSESİ"]
[{"$f":"IF(ISTEXT(D7),1,\"\")","v":""},null,{"$f":"'Seçilen Öğretmen'!B3","v":" "},{"$f":"IF('Seçilen Öğretmen'!C3=\"\",\"\",'Seçilen Öğretmen'!C3)","v":0},{"$f":"IF('Seçilen Öğretmen'!D3=\"\",\"\",'Seçilen Öğretmen'!D3)","v":0},{"$f":"IF('Seçilen Öğretmen'!E3=\"\",\"\",'Seçilen Öğretmen'!E3)","v":0},{"$f":"IF('Seçilen Öğretmen'!F3=\"\",\"\",'Seçilen Öğretmen'!F3)","v":0},null,null,null,null,null,null,null,null,null,null,{"$f":"SUM(H7:Q7)","v":0},{"$f":"IF(V7>0,U7,0)","v":0},null,{"$f":"ROUND(SUM(V7/Z7),2)","v":{"$error":"#DIV/0!"}},{"$f":"ROUND(SUM(H7+I7+J7+M7),2)","v":0},{"$f":"COUNTIF(H7,\">0\")","v":0},{"$f":"COUNTIF(I7,\">0\")","v":0},{"$f":"COUNTIF(J7,\">0\")","v":0},{"$f":"W7+X7+Y7+AB7","v":0},{"$f":"VALUE(Z7)","v":0},{"$f":"COUNTIF(M7,\">0\")","v":0}]
[{"$f":"IF(ISTEXT(D8),1,\"\")","v":""},null,{"$f":"'Seçilen Öğretmen'!B4","v":" "},{"$f":"IF('Seçilen Öğretmen'!C4=\"\",\"\",'Seçilen Öğretmen'!C4)","v":0},{"$f":"IF('Seçilen Öğretmen'!D4=\"\",\"\",'Seçilen Öğretmen'!D4)","v":0},{"$f":"IF('Seçilen Öğretmen'!E4=\"\",\"\",'Seçilen Öğretmen'!E4)","v":0},{"$f":"IF('Seçilen Öğretmen'!F4=\"\",\"\",'Seçilen Öğretmen'!F4)","v":0},null,null,null,null,null,null,null,null,null,null,{"$f":"SUM(H8:Q8)","v":0},0,null,{"$error":"#DIV/0!"},0,0,0,0,0,null,0]
["",null,{"$f":"'Seçilen Öğretmen'!B5","v":" "},{"$f":"IF('Seçilen Öğretmen'!C5=\"\",\"\",'Seçilen Öğretmen'!C5)","v":0},{"$f":"IF('Seçilen Öğretmen'!D5=\"\",\"\",'Seçilen Öğretmen'!D5)","v":0},{"$f":"IF('Seçilen Öğretmen'!E5=\"\",\"\",'Seçilen Öğretmen'!E5)","v":0},{"$f":"IF('Seçilen Öğretmen'!F5=\"\",\"\",'Seçilen Öğretmen'!F5)","v":0},null,null,null,null,null,null,null,null,null,null,0,0,null,{"$error":"#DIV/0!"},0,0,0,0,0,null,0]
["",null,{"$f":"'Seçilen Öğretmen'!B6","v":" "},{"$f":"IF('Seçilen Öğretmen'!C6=\" \",\" \",'Seçilen Öğretmen'!C6)","v":0},{"$f":"IF('Seçilen Öğretmen'!D6=\"\",\"\",'Seçilen Öğretmen'!D6)","v":0},{"$f":"IF('Seçilen Öğretmen'!E6=\"\",\"\",'Seçilen Öğretmen'!E6)","v":0},{"$f":"IF('Seçilen Öğretmen'!F6=\"\",\"\",'Seçilen Öğretmen'!F6)","v":0},null,null,null,null,null,null,null,null,null,null,0,0,null,{"$error":"#DIV/0!"},0,0,0,0,0,null,0]
["",null,{"$f":"'Seçilen Öğretmen'!B7","v":" "},{"$f":"IF('Seçilen Öğretmen'!C7=\"\",\"\",'Seçilen Öğretmen'!C7)","v":0},{"$f":"IF('Seçilen Öğretmen'!D7=\"\",\"\",'Seçilen Öğretmen'!D7)","v":0},{"$f":"IF('Seçilen Öğretmen'!E7=\"\",\"\",'Seçilen Öğretmen'!E7)","v":0},{"$f":"IF('Seçilen Öğretmen'!F7=\"\",\"\",'Seçilen Öğretmen'!F7)","v":0},null,null,null,null,null,null,null,null,null,null,0,0,null,{"$error":"#DIV/0!"},0,0,0,0,0,null,0]
["",null,{"$f":"'Seçilen Öğretmen'!B8","v":" "},{"$f":"IF('Seçilen Öğretmen'!C8=\"\",\"\",'Seçilen Öğretmen'!C8)","v":0},{"$f":"IF('Seçilen Öğretmen'!D8=\"\",\"\",'Seçilen Öğretmen'!D8)","v":0},{"$f":"IF('Seçilen Öğretmen'!E8=\"\",\"\",'Seçilen Öğretmen'!E8)","v":0},{"$f":"IF('Seçilen Öğretmen'!F8=\"\",\"\",'Seçilen Öğretmen'!F8)","v":0},null,null,null,null,null,null,null,null,null,null,0,0,null,{"$error":"#DIV/0!"},0,0,0,0,0,null,0]
["",null,{"$f":"'Seçilen Öğretmen'!B9","v":" "},{"$f":"IF('Seçilen Öğretmen'!C9=\"\",\"\",'Seçilen Öğretmen'!C9)","v":0},{"$f":"IF('Seçilen Öğretmen'!D9=\"\",\"\",'Seçilen Öğretmen'!D9)","v":0},{"$f":"IF('Seçilen Öğretmen'!E9=\"\",\"\",'Seçilen Öğretmen'!E9)","v":0},{"$f":"IF('Seçilen Öğretmen'!F9=\"\",\"\",'Seçilen Öğretmen'!F9)","v":0},null,null,null,null,null,null,null,null,null,null,0,0,null,{"$error":"#DIV/0!"},0,0,0,0,0,null,0]
["",null,{"$f":"'Seçilen Öğretmen'!B10","v":" "},{"$f":"IF('Seçilen Öğretmen'!C10=\"\",\"\",'Seçilen Öğretmen'!C10)","v":0},{"$f":"IF('Seçilen Öğretmen'!D10=\"\",\"\",'Seçilen Öğretmen'!D10)","v":0},{"$f":"IF('Seçilen Öğretmen'!E10=\"\",\"\",'Seçilen Öğretmen'!E10)","v":0},{"$f":"IF('Seçilen Öğretmen'!F10=\"\",\"\",'Seçilen Öğretmen'!F10)","v":0},null,null,null,null,null,null,null,null,null,null,0,0,null,{"$error":"#DIV/0!"},0,0,0,0,0,null,0]
[{"$f":"IF(ISTEXT(D15),1,\"\")","v":""},null,{"$f":"'Seçilen Öğretmen'!B11","v":" "},{"$f":"IF('Seçilen Öğretmen'!C11=\"\",\"\",'Seçilen Öğretmen'!C11)","v":0},{"$f":"IF('Seçilen Öğretmen'!D11=\"\",\"\",'Seçilen Öğretmen'!D11)","v":0},{"$f":"IF('Seçilen Öğretmen'!E11=\"\",\"\",'Seçilen Öğretmen'!E11)","v":0},{"$f":"IF('Seçilen Öğretmen'!F11=\"\",\"\",'Seçilen Öğretmen'!F11)","v":0},null,null,null,null,null,null,null,null,null,null,0,{"$f":"IF(V15>0,U15,0)","v":0},null,{"$f":"ROUND(SUM(V15/Z15),2)","v":{"$error":"#DIV/0!"}},0,0,0,0,{"$f":"W15+X15+Y15+AB15","v":0},null,0]
["",null,{"$f":"'Seçilen Öğretmen'!B12","v":" "},{"$f":"IF('Seçilen Öğretmen'!C12=\"\",\"\",'Seçilen Öğretmen'!C12)","v":0},{"$f":"IF('Seçilen Öğretmen'!D12=\"\",\"\",'Seçilen Öğretmen'!D12)","v":0},{"$f":"IF('Seçilen Öğretmen'!E12=\"\",\"\",'Seçilen Öğretmen'!E12)","v":0},{"$f":"IF('Seçilen Öğretmen'!F12=\"\",\"\",'Seçilen Öğretmen'!F12)","v":0},null,null,null,null,null,null,null,null,null,null,0,0,null,{"$error":"#DIV/0!"},0,0,0,0,0,null,0]
["",null,{"$f":"'Seçilen Öğretmen'!B13","v":" "},{"$f":"IF('Seçilen Öğretmen'!C13=\"\",\"\",'Seçilen Öğretmen'!C13)","v":0},{"$f":"IF('Seçilen Öğretmen'!D13=\"\",\"\",'Seçilen Öğretmen'!D13)","v":0},{"$f":"IF('Seçilen Öğretmen'!E13=\"\",\"\",'Seçilen Öğretmen'!E13)","v":0},{"$f":"IF('Seçilen Öğretmen'!F13=\"\",\"\",'Seçilen Öğretmen'!F13)","v":0},null,null,null,null,null,null,null,null,null,null,0,0,null,{"$error":"#DIV/0!"},0,0,0,0,0,null,0]
["",null,{"$f":"'Seçilen Öğretmen'!B14","v":" "},{"$f":"IF('Seçilen Öğretmen'!C14=\"\",\"\",'Seçilen Öğretmen'!C14)","v":0},{"$f":"IF('Seçilen Öğretmen'!D14=\"\",\"\",'Seçilen Öğretmen'!D14)","v":0},{"$f":"IF('Seçilen Öğretmen'!E14=\"\",\"\",'Seçilen Öğretmen'!E14)","v":0},{"$f":"IF('Seçilen Öğretmen'!F14=\"\",\"\",'Seçilen Öğretmen'!F14)","v":0},null,null,null,null,null,null,null,null,null,null,0,0,null,{"$error":"#DIV/0!"},0,0,0,0,0,null,0]
["",null,{"$f":"'Seçilen Öğretmen'!B15","v":" "},{"$f":"IF('Seçilen Öğretmen'!C15=\"\",\"\",'Seçilen Öğretmen'!C15)","v":0},{"$f":"IF('Seçilen Öğretmen'!D15=\"\",\"\",'Seçilen Öğretmen'!D15)","v":0},{"$f":"IF('Seçilen Öğretmen'!E15=\"\",\"\",'Seçilen Öğretmen'!E15)","v":0},{"$f":"IF('Seçilen Öğretmen'!F15=\"\",\"\",'Seçilen Öğretmen'!F15)","v":0},null,null,null,null,null,null,null,null,null,null,0,0,null,{"$error":"#DIV/0!"},0,0,0,0,0,null,0]
["",null,{"$f":"'Seçilen Öğretmen'!B16","v":" "},{"$f":"IF('Seçilen Öğretmen'!C16=\"\",\"\",'Seçilen Öğretmen'!C16)","v":0},{"$f":"IF('Seçilen Öğretmen'!D16=\"\",\"\",'Seçilen Öğretmen'!D16)","v":0},{"$f":"IF('Seçilen Öğretmen'!E16=\"\",\"\",'Seçilen Öğretmen'!E16)","v":0},{"$f":"IF('Seçilen Öğretmen'!F16=\"\",\"\",'Seçilen Öğretmen'!F16)","v":0},null,null,null,null,null,null,null,null,null,null,0,0,null,{"$error":"#DIV/0!"},0,0,0,0,0,null,0]
{"$rows_left_out":34}
{"sheet":"Öğrenci Listeleri","index":2,"n_rows":882,"n_cols":12,"rows_kept":882,"cut":false,"hidden":false,"merged":[[842,6,881,6],[522,6,561,6],[562,6,601,6],[602,6,641,6],[642,6,681,6],[682,6,721,6],[802,6,841,6],[2,6,41,6],[42,6,81,6],[82,6,121,6],[122,6,161,6],[162,6,201,6],[202,6,241,6],[242,6,281,6],[282,6,321,6],[322,6,361,6],[362,6,401,6],[402,6,441,6],[442,6,481,6],[722,6,761,6],[762,6,801,6],[482,6,521,6]]}
[]
[null,"S.No","DERS","SINIFI","NO","ADI SOYADI"]
[null,1,null,null,null,null,{"$f":"K4","v":"EBRU BUSE GÜDER"},null,null,null,"Sınıf İsmi"]
[null,2,null,null,null,null,null,null,null,null,{"$f":"IF(Kaynaklarımız!C3=0,\" \",Kaynaklarımız!C3)","v":"EBRU BUSE GÜDER"},{"$f":"Kaynaklarımız!B3","v":1}]
[null,3,null,null,null,null,null,null,null,null,{"$f":"IF(Kaynaklarımız!C4=0,\" \",Kaynaklarımız!C4)","v":"DÖNDÜ ÜNAL"},{"$f":"Kaynaklarımız!B4","v":2}]
[null,4,null,null,null,null,null,null,null,null,{"$f":"IF(Kaynaklarımız!C5=0,\" \",Kaynaklarımız!C5)","v":"GÖKHAN EKER"},{"$f":"Kaynaklarımız!B5","v":3}]
[null,5,null,null,null,null,null,null,null,null,{"$f":"IF(Kaynaklarımız!C6=0,\" \",Kaynaklarımız!C6)","v":"METİN ÖNDER"},{"$f":"Kaynaklarımız!B6","v":4}]
[null,6,null,null,null,null,null,null,null,null,{"$f":"IF(Kaynaklarımız!C7=0,\" \",Kaynaklarımız!C7)","v":"LEVENT DEMİR"},{"$f":"Kaynaklarımız!B7","v":5}]
[null,7,null,null,null,null,null,null,null,null,{"$f":"IF(Kaynaklarımız!C8=0,\" \",Kaynaklarımız!C8)","v":"HÜRKAN METE"},{"$f":"Kaynaklarımız!B8","v":6}]
[null,8,null,null,null,null,null,null,null,null,{"$f":"IF(Kaynaklarımız!C9=0,\" \",Kaynaklarımız!C9)","v":"AHMET FURKAN GÜNEŞ"},{"$f":"Kaynaklarımız!B9","v":7}]
[null,9,null,null,null,null,null,null,null,null,{"$f":"IF(Kaynaklarımız!C10=0,\" \",Kaynaklarımız!C10)","v":"ESRA KAYAR"},{"$f":"Kaynaklarımız!B10","v":8}]
[null,10,null,null,null,null,null,null,null,null,{"$f":"IF(Kaynaklarımız!C11=0,\" \",Kaynaklarımız!C11)","v":"SEHURE CAN"},{"$f":"Kaynaklarımız!B11","v":9}]
[null,11,null,null,null,null,null,null,null,null,{"$f":"IF(Kaynaklarımız!C12=0,\" \",Kaynaklarımız!C12)","v":"FATİH ÇALHAN"},{"$f":"Kaynaklarımız!B12","v":10}]
[null,12,null,null,null,null,null,null,null,null,{"$f":"IF(Kaynaklarımız!C13=0,\" \",Kaynaklarımız!C13)","v":"BİRGÜL IRMAK"},{"$f":"Kaynaklarımız!B13","v":11}]
[null,13,null,null,null,null,null,null,null,null,{"$f":"IF(Kaynaklarımız!C14=0,\" \",Kaynaklarımız!C14)","v":"MUHAMMET YILMAZ"},{"$f":"Kaynaklarımız!B14","v":12}]
[null,14,null,null,null,null,null,null,null,null,{"$f":"IF(Kaynaklarımız!C15=0,\" \",Kaynaklarımız!C15)","v":"SEHURE CAN"},{"$f":"Kaynaklarımız!B15","v":13}]
[null,15,null,null,null,null,null,null,null,null,{"$f":"IF(Kaynaklarımız!C16=0,\" \",Kaynaklarımız!C16)","v":"ABDULLAH ŞENGÖNÜL"},{"$f":"Kaynaklarımız!B16","v":14}]
[null,16,null,null,null,null,null,null,null,null,{"$f":"IF(Kaynaklarımız!C17=0,\" \",Kaynaklarımız!C17)","v":"FATMA ÇAKMAK"},{"$f":"Kaynaklarımız!B17","v":15}]
[null,17,null,null,null,null,null,null,null,null,{"$f":"IF(Kaynaklarımız!C18=0,\" \",Kaynaklarımız!C18)","v":" "},{"$f":"Kaynaklarımız!B18","v":16}]
[null,18,null,null,null,null,null,null,null,null,{"$f":"IF(Kaynaklarımız!C19=0,\" \",Kaynaklarımız!C19)","v":" "},{"$f":"Kaynaklarımız!B19","v":17}]
{"$rows_left_out":863}
{"sheet":"Seçilen Öğretmen","index":3,"n_rows":42,"n_cols":6,"rows_kept":42,"cut":false,"hidden":true,"merged":[]}
[]
["NO","S.NO","DERS","SINIFI","NO","ADI SOYADI"]
[{"$f":"VLOOKUP(Anasayfa!C5,'Öğrenci Listeleri'!$K$4:$L$32,2,0)","v":1},{"$f":"IF(C3>0,1,\" \")","v":" "},{"$f":"IF(A3<>\"\",VLOOKUP($A3,'Öğrenci Listeleri'!B:F,2),\"\")","v":0},{"$f":"IF(C3<>\"\",VLOOKUP($A3,'Öğrenci Listeleri'!B:F,3),\"\")","v":0},{"$f":"IF(C3<>\"\",VLOOKUP($A3,'Öğrenci Listeleri'!B:F,4),\"\")","v":0},{"$f":"IF(C3<>\"\",VLOOKUP($A3,'Öğrenci Listeleri'!B:F,5),\"\")","v":0}]
[{"$f":"A3+1","v":2},{"$f":"IF(C4>0,B3+1,\" \")","v":" "},{"$f":"IF(A4<>\"\",VLOOKUP($A4,'Öğrenci Listeleri'!B:F,2),\"\")","v":0},{"$f":"IF(C4<>\"\",VLOOKUP($A4,'Öğrenci Listeleri'!B:F,3),\"\")","v":0},{"$f":"IF(C4<>\"\",VLOOKUP($A4,'Öğrenci Listeleri'!B:F,4),\"\")","v":0},{"$f":"IF(C4<>\"\",VLOOKUP($A4,'Öğrenci Listeleri'!B:F,5),\"\")","v":0}]
[{"$f":"A4+1","v":3},{"$f":"IF(C5>0,B4+1,\" \")","v":" "},{"$f":"IF(A5<>\"\",VLOOKUP($A5,'Öğrenci Listeleri'!B:F,2),\"\")","v":0},{"$f":"IF(C5<>\"\",VLOOKUP($A5,'Öğrenci Listeleri'!B:F,3),\"\")","v":0},{"$f":"IF(C5<>\"\",VLOOKUP($A5,'Öğrenci Listeleri'!B:F,4),\"\")","v":0},{"$f":"IF(C5<>\"\",VLOOKUP($A5,'Öğrenci Listeleri'!B:F,5),\"\")","v":0}]
[4," ",{"$f":"IF(A6<>\"\",VLOOKUP($A6,'Öğrenci Listeleri'!B:F,2),\"\")","v":0},{"$f":"IF(C6<>\"\",VLOOKUP($A6,'Öğrenci Listeleri'!B:F,3),\"\")","v":0},{"$f":"IF(C6<>\"\",VLOOKUP($A6,'Öğrenci Listeleri'!B:F,4),\"\")","v":0},{"$f":"IF(C6<>\"\",VLOOKUP($A6,'Öğrenci Listeleri'!B:F,5),\"\")","v":0}]
[5," ",{"$f":"IF(A7<>\"\",VLOOKUP($A7,'Öğrenci Listeleri'!B:F,2),\"\")","v":0},{"$f":"IF(C7<>\"\",VLOOKUP($A7,'Öğrenci Listeleri'!B:F,3),\"\")","v":0},{"$f":"IF(C7<>\"\",VLOOKUP($A7,'Öğrenci Listeleri'!B:F,4),\"\")","v":0},{"$f":"IF(C7<>\"\",VLOOKUP($A7,'Öğrenci Listeleri'!B:F,5),\"\")","v":0}]
[6," ",{"$f":"IF(A8<>\"\",VLOOKUP($A8,'Öğrenci Listeleri'!B:F,2),\"\")","v":0},{"$f":"IF(C8<>\"\",VLOOKUP($A8,'Öğrenci Listeleri'!B:F,3),\"\")","v":0},{"$f":"IF(C8<>\"\",VLOOKUP($A8,'Öğrenci Listeleri'!B:F,4),\"\")","v":0},{"$f":"IF(C8<>\"\",VLOOKUP($A8,'Öğrenci Listeleri'!B:F,5),\"\")","v":0}]
[7," ",{"$f":"IF(A9<>\"\",VLOOKUP($A9,'Öğrenci Listeleri'!B:F,2),\"\")","v":0},{"$f":"IF(C9<>\"\",VLOOKUP($A9,'Öğrenci Listeleri'!B:F,3),\"\")","v":0},{"$f":"IF(C9<>\"\",VLOOKUP($A9,'Öğrenci Listeleri'!B:F,4),\"\")","v":0},{"$f":"IF(C9<>\"\",VLOOKUP($A9,'Öğrenci Listeleri'!B:F,5),\"\")","v":0}]
[8," ",{"$f":"IF(A10<>\"\",VLOOKUP($A10,'Öğrenci Listeleri'!B:F,2),\"\")","v":0},{"$f":"IF(C10<>\"\",VLOOKUP($A10,'Öğrenci Listeleri'!B:F,3),\"\")","v":0},{"$f":"IF(C10<>\"\",VLOOKUP($A10,'Öğrenci Listeleri'!B:F,4),\"\")","v":0},{"$f":"IF(C10<>\"\",VLOOKUP($A10,'Öğrenci Listeleri'!B:F,5),\"\")","v":0}]
[9," ",{"$f":"IF(A11<>\"\",VLOOKUP($A11,'Öğrenci Listeleri'!B:F,2),\"\")","v":0},{"$f":"IF(C11<>\"\",VLOOKUP($A11,'Öğrenci Listeleri'!B:F,3),\"\")","v":0},{"$f":"IF(C11<>\"\",VLOOKUP($A11,'Öğrenci Listeleri'!B:F,4),\"\")","v":0},{"$f":"IF(C11<>\"\",VLOOKUP($A11,'Öğrenci Listeleri'!B:F,5),\"\")","v":0}]
[10," ",{"$f":"IF(A12<>\"\",VLOOKUP($A12,'Öğrenci Listeleri'!B:F,2),\"\")","v":0},{"$f":"IF(C12<>\"\",VLOOKUP($A12,'Öğrenci Listeleri'!B:F,3),\"\")","v":0},{"$f":"IF(C12<>\"\",VLOOKUP($A12,'Öğrenci Listeleri'!B:F,4),\"\")","v":0},{"$f":"IF(C12<>\"\",VLOOKUP($A12,'Öğrenci Listeleri'!B:F,5),\"\")","v":0}]
[11," ",{"$f":"IF(A13<>\"\",VLOOKUP($A13,'Öğrenci Listeleri'!B:F,2),\"\")","v":0},{"$f":"IF(C13<>\"\",VLOOKUP($A13,'Öğrenci Listeleri'!B:F,3),\"\")","v":0},{"$f":"IF(C13<>\"\",VLOOKUP($A13,'Öğrenci Listeleri'!B:F,4),\"\")","v":0},{"$f":"IF(C13<>\"\",VLOOKUP($A13,'Öğrenci Listeleri'!B:F,5),\"\")","v":0}]
[12," ",{"$f":"IF(A14<>\"\",VLOOKUP($A14,'Öğrenci Listeleri'!B:F,2),\"\")","v":0},{"$f":"IF(C14<>\"\",VLOOKUP($A14,'Öğrenci Listeleri'!B:F,3),\"\")","v":0},{"$f":"IF(C14<>\"\",VLOOKUP($A14,'Öğrenci Listeleri'!B:F,4),\"\")","v":0},{"$f":"IF(C14<>\"\",VLOOKUP($A14,'Öğrenci Listeleri'!B:F,5),\"\")","v":0}]
[13," ",{"$f":"IF(A15<>\"\",VLOOKUP($A15,'Öğrenci Listeleri'!B:F,2),\"\")","v":0},{"$f":"IF(C15<>\"\",VLOOKUP($A15,'Öğrenci Listeleri'!B:F,3),\"\")","v":0},{"$f":"IF(C15<>\"\",VLOOKUP($A15,'Öğrenci Listeleri'!B:F,4),\"\")","v":0},{"$f":"IF(C15<>\"\",VLOOKUP($A15,'Öğrenci Listeleri'!B:F,5),\"\")","v":0}]
[14," ",{"$f":"IF(A16<>\"\",VLOOKUP($A16,'Öğrenci Listeleri'!B:F,2),\"\")","v":0},{"$f":"IF(C16<>\"\",VLOOKUP($A16,'Öğrenci Listeleri'!B:F,3),\"\")","v":0},{"$f":"IF(C16<>\"\",VLOOKUP($A16,'Öğrenci Listeleri'!B:F,4),\"\")","v":0},{"$f":"IF(C16<>\"\",VLOOKUP($A16,'Öğrenci Listeleri'!B:F,5),\"\")","v":0}]
[15," ",{"$f":"IF(A17<>\"\",VLOOKUP($A17,'Öğrenci Listeleri'!B:F,2),\"\")","v":0},{"$f":"IF(C17<>\"\",VLOOKUP($A17,'Öğrenci Listeleri'!B:F,3),\"\")","v":0},{"$f":"IF(C17<>\"\",VLOOKUP($A17,'Öğrenci Listeleri'!B:F,4),\"\")","v":0},{"$f":"IF(C17<>\"\",VLOOKUP($A17,'Öğrenci Listeleri'!B:F,5),\"\")","v":0}]
[16," ",{"$f":"IF(A18<>\"\",VLOOKUP($A18,'Öğrenci Listeleri'!B:F,2),\"\")","v":0},{"$f":"IF(C18<>\"\",VLOOKUP($A18,'Öğrenci Listeleri'!B:F,3),\"\")","v":0},{"$f":"IF(C18<>\"\",VLOOKUP($A18,'Öğrenci Listeleri'!B:F,4),\"\")","v":0},{"$f":"IF(C18<>\"\",VLOOKUP($A18,'Öğrenci Listeleri'!B:F,5),\"\")","v":0}]
[17," ",{"$f":"IF(A19<>\"\",VLOOKUP($A19,'Öğrenci Listeleri'!B:F,2),\"\")","v":0},{"$f":"IF(C19<>\"\",VLOOKUP($A19,'Öğrenci Listeleri'!B:F,3),\"\")","v":0},{"$f":"IF(C19<>\"\",VLOOKUP($A19,'Öğrenci Listeleri'!B:F,4),\"\")","v":0},{"$f":"IF(C19<>\"\",VLOOKUP($A19,'Öğrenci Listeleri'!B:F,5),\"\")","v":0}]
[18," ",{"$f":"IF(A20<>\"\",VLOOKUP($A20,'Öğrenci Listeleri'!B:F,2),\"\")","v":0},{"$f":"IF(C20<>\"\",VLOOKUP($A20,'Öğrenci Listeleri'!B:F,3),\"\")","v":0},{"$f":"IF(C20<>\"\",VLOOKUP($A20,'Öğrenci Listeleri'!B:F,4),\"\")","v":0},{"$f":"IF(C20<>\"\",VLOOKUP($A20,'Öğrenci Listeleri'!B:F,5),\"\")","v":0}]
{"$rows_left_out":23}
{"sheet":"Kaynaklarımız","index":4,"n_rows":28,"n_cols":5,"rows_kept":28,"cut":false,"hidden":false,"merged":[]}
[]
[null,"SIRA NO","ÖĞRETMENLER","BRANŞLAR","EĞİTİM-ÖĞRETİM YILI"]
[null,1,"EBRU BUSE GÜDER","İNGİLİZCE","2017/2018"]
[null,2,"DÖNDÜ ÜNAL","MATEMATİK","2017/2018"]
[null,3,"GÖKHAN EKER","TARİH","2017/2018"]
[null,4,"METİN ÖNDER","İHL MESLEK DERSLERİ","2017/2018"]
[null,5,"LEVENT DEMİR","İHL MESLEK DERSLERİ","2017/2018"]
[null,6,"HÜRKAN METE","İHL MESLEK DERSLERİ","2017/2018"]
[null,7,"AHMET FURKAN GÜNEŞ","İHL MESLEK DERSLERİ","2017/2018"]
[null,8,"ESRA KAYAR","FİZİK","2017/2018"]
[null,9,"SEHURE CAN","MATEMATİK","2017/2018"]
[null,10,"FATİH ÇALHAN","COĞRAFYA","2017/2018"]
[null,11,"BİRGÜL IRMAK","TÜRK DİLİ VE EDEBİYATI","2017/2018"]
[null,12,"MUHAMMET YILMAZ","TÜRK DİLİ VE EDEBİYATI","2017/2018"]
[null,13,"SEHURE CAN","KİMYA","2017/2018"]
[null,14,"ABDULLAH ŞENGÖNÜL","BEDEN EĞİTİMİ","2017/2018"]
[null,15,"FATMA ÇAKMAK","GÖRSEL SANATLAR","2017/2018"]
[null,16]
[null,17]
[null,18]
{"$rows_left_out":8}