{"text_format":"1","workbook":"xlsx","n_sheets":5,"sheets":["Anasayfa","Değerlendirme Formu","Öğrenci Listeleri","Seçilen Öğretmen","Kaynaklarımız"],"not_rendered":{"charts":0,"images":6,"macros":1,"external_links":0,"defined_names":13,"comments":1,"pivot_tables":0},"unopened":[],"bounds":{"document_bytes":16777216,"sheet_cells":100000,"rows_first":2000,"rows_last":500,"rows_between":2000,"halvings":0,"cell_chars":16384,"cell_head_chars":4096},"cells_cut":0,"cells_raw":0,"read":"whole","date_system":"1900"}

{"sheet":"Anasayfa","index":0,"n_rows":13,"n_cols":9,"rows_kept":13,"cut":false,"hidden":false,"merged":[[12,1,12,5],[12,7,14,8],[1,1,1,2],[2,1,2,2],[3,1,3,2],[9,1,9,5],[10,1,10,5],[11,1,11,5]]}
[]
[null,"SARAY ŞEHİT MURAT DİLMAÇ ANADOLU İMAM HATİP LİSESİ",null,null,null,null,null,"DEĞERLENDİRME KRİTERLERİ","PUAN DEĞERİ"]
[null,"PROJE ÇALIŞMASI DEĞERLENDİRME FORMU",null,null,null,null,null,"Projenin Tamamlanması",10]
[null,null,null,null,null,null,null,"Rapor (Yazı Güzelliği)",8]
[null,"ÖĞRETMEN ADI","EBRU BUSE GÜDER",null,null,null,null,"Düzen ve Temizlik",9]
[null,"BRANŞI",{"$f":"VLOOKUP(C5,Kaynaklarımız!$C$3:$D$28,2,0)","v":"İNGİLİZCE"},null,null,null,null,"Projenin Doğruluk Derecesi",7]
[null,"EĞİTİM-ÖĞRETİM YILI","2017-2018",null,null,null,null,"Harcanan zaman ve emek",11]
[null,null,null,null,null,null,null,"Proje Anlaşılmış",5]
[null,null,null,null,null,null,null,"Proje ilgili sorulara yanıt verir",11]
[null,"SAYFA KORUMA ŞİFRESİ : -",null,null,null,null,null,"Proje zamanında teslim edildi",12]
[null,"* ÖĞRETMEN, YIL SEÇİMLERİ, DEĞERLENDİRME KRİTERLERİ VE PUANLARI BU SAYFADAN YAPILACAKTIR.",null,null,null,null,null,"Kaynak Kullanımı",13]
[null,"* PROJE ALAN ÖĞRENCİ LİSTELERİ GÜNCEL DURUMA GÖRE YAPILMIŞTIR. EKSİKLİK VEYA HATA VARSA ÖĞRENCİ LİSTELERİ SAYFASINDAN KENDİ BÖLÜMÜNÜZE GİDEREK GÜNCELLEME YAPABİLİRSİNİZ.",null,null,null,null,null,"Sunum",14]
[null,"* DEĞERLENDİRME FORMU SAYFASINDA SADECE PUANLARI YAZACAKSINIZ, DİĞER BÖLÜMLER KENDİLİĞİNDEN GÜNCELLENECEKTİR.",null,null,null,null,null," DEĞERLENDİRME KRİTERLERİ ZÜMREDE BELİRTİLEN KRİTERLE DEĞİŞTİRİLECEKTİR. EN FAZLA 10 DEĞERLENDİRME KRİTERİ YAZABİLİRSİNİZ."]

{"sheet":"Değerlendirme Formu","index":1,"n_rows":53,"n_cols":28,"rows_kept":53,"cut":false,"hidden":false,"merged":[[2,2,2,17],[48,2,48,17],[47,2,47,5],[1,2,1,17],[3,2,3,6],[4,2,4,6],[5,7,5,17],[47,6,47,15],[47,16,47,17],[49,11,49,17],[52,9,52,10],[52,4,52,6],[52,7,52,8],[51,9,51,10],[51,4,51,6],[51,7,51,8],[51,11,51,17],[52,11,52,17]]}
[]
[null,null,{"$f":"Anasayfa!B2","v":"SARAY ŞEHİT MURAT DİLMAÇ ANADOLU İMAM HATİP LİSESİ"}]
[null,null,{"$f":"Anasayfa!C7&\" \"&\"EĞİTİM-ÖĞRETİM YILI PROJE DEĞERLENDİRME FORMU\"","v":"2017-2018 EĞİTİM-ÖĞRETİM YILI PROJE DEĞERLENDİRME FORMU"},null,null,null,null,null,null,null,null,null,null,null,null,null,null,null,null,null,null,null,2,{"$f":"AVERAGE(U3,V3,W3)","v":2},{"$f":"IF(V3>0,V3,0)","v":0}]
[null,null,"ÖLÇÜTLER",null,null,null,null,{"$f":"IF(Anasayfa!H3=0,\" \",Anasayfa!H3)","v":"Projenin Tamamlanması"},{"$f":"IF(Anasayfa!H4=0,\" \",Anasayfa!H4)","v":"Rapor (Yazı Güzelliği)"},{"$f":"IF(Anasayfa!H5=0,\" \",Anasayfa!H5)","v":"Düzen ve Temizlik"},{"$f":"IF(Anasayfa!H6=0,\" \",Anasayfa!H6)","v":"Projenin Doğruluk Derecesi"},{"$f":"IF(Anasayfa!H7=0,\" \",Anasayfa!H7)","v":"Harcanan zaman ve emek"},{"$f":"IF(Anasayfa!H8=0,\" \",Anasayfa!H8)","v":"Proje Anlaşılmış"},{"$f":"IF(Anasayfa!H9=0,\" \",Anasayfa!H9)","v":"Proje ilgili sorulara yanıt verir"},{"$f":"IF(Anasayfa!H10=0,\" \",Anasayfa!H10)","v":"Proje zamanında teslim edildi"},{"$f":"IF(Anasayfa!H11=0,\" \",Anasayfa!H11)","v":"Kaynak Kullanımı"},{"$f":"IF(Anasayfa!H12=0,\" \",Anasayfa!H12)","v":"Sunum"},"TOPLAM"]
[null,null,"Ölçütlerin Puan Değerleri",null,null,null,null,{"$f":"IF(Anasayfa!I3=0,\" \",Anasayfa!I3)","v":10},{"$f":"IF(Anasayfa!I4=0,\" \",Anasayfa!I4)","v":8},{"$f":"IF(Anasayfa!I5=0,\" \",Anasayfa!I5)","v":9},{"$f":"IF(Anasayfa!I6=0,\" \",Anasayfa!I6)","v":7},{"$f":"IF(Anasayfa!I7=0,\" \",Anasayfa!I7)","v":11},{"$f":"IF(Anasayfa!I8=0,\" \",Anasayfa!I8)","v":5},{"$f":"IF(Anasayfa!I9=0,\" \",Anasayfa!I9)","v":11},{"$f":"IF(Anasayfa!I10=0,\" \",Anasayfa!I10)","v":12},{"$f":"IF(Anasayfa!I11=0,\" \",Anasayfa!I11)","v":13},{"$f":"IF(Anasayfa!I12=0,\" \",Anasayfa!I12)","v":14},{"$f":"SUM(H5:Q5)","v":100}]
[null,null,"SIRA","DERS","SINIFI","NO","ADI SOYADI","SARAY ŞEHİT MURAT DİLMAÇ ANADOLU İMAM HATİP LİSESİ"]
[{"$f":"IF(ISTEXT(D7),1,\"\")","v":""},null,{"$f":"'Seçilen Öğretmen'!B3","v":" "},{"$f":"IF('Seçilen Öğretmen'!C3=\"\",\"\",'Seçilen Öğretmen'!C3)","v":0},{"$f":"IF('Seçilen Öğretmen'!D3=\"\",\"\",'Seçilen Öğretmen'!D3)","v":0},{"$f":"IF('Seçilen Öğretmen'!E3=\"\",\"\",'Seçilen Öğretmen'!E3)","v":0},{"$f":"IF('Seçilen Öğretmen'!F3=\"\",\"\",'Seçilen Öğretmen'!F3)","v":0},null,null,null,null,null,null,null,null,null,null,{"$f":"SUM(H7:Q7)","v":0},{"$f":"IF(V7>0,U7,0)","v":0},null,{"$f":"ROUND(SUM(V7/Z7),2)","v":{"$error":"#DIV/0!"}},{"$f":"ROUND(SUM(H7+I7+J7+M7),2)","v":0},{"$f":"COUNTIF(H7,\">0\")","v":0},{"$f":"COUNTIF(I7,\">0\")","v":0},{"$f":"COUNTIF(J7,\">0\")","v":0},{"$f":"W7+X7+Y7+AB7","v":0},{"$f":"VALUE(Z7)","v":0},{"$f":"COUNTIF(M7,\">0\")","v":0}]
[{"$f":"IF(ISTEXT(D8),1,\"\")","v":""},null,{"$f":"'Seçilen Öğretmen'!B4","v":" "},{"$f":"IF('Seçilen Öğretmen'!C4=\"\",\"\",'Seçilen Öğretmen'!C4)","v":0},{"$f":"IF('Seçilen Öğretmen'!D4=\"\",\"\",'Seçilen Öğretmen'!D4)","v":0},{"$f":"IF('Seçilen Öğretmen'!E4=\"\",\"\",'Seçilen Öğretmen'!E4)","v":0},{"$f":"IF('Seçilen Öğretmen'!F4=\"\",\"\",'Seçilen Öğretmen'!F4)","v":0},null,null,null,null,null,null,null,null,null,null,{"$f":"SUM(H8:Q8)","v":0},0,null,{"$error":"#DIV/0!"},0,0,0,0,0,null,0]
["",null,{"$f":"'Seçilen Öğretmen'!B5","v":" "},{"$f":"IF('Seçilen Öğretmen'!C5=\"\",\"\",'Seçilen Öğretmen'!C5)","v":0},{"$f":"IF('Seçilen Öğretmen'!D5=\"\",\"\",'Seçilen Öğretmen'!D5)","v":0},{"$f":"IF('Seçilen Öğretmen'!E5=\"\",\"\",'Seçilen Öğretmen'!E5)","v":0},{"$f":"IF('Seçilen Öğretmen'!F5=\"\",\"\",'Seçilen Öğretmen'!F5)","v":0},null,null,null,null,null,null,null,null,null,null,0,0,null,{"$error":"#DIV/0!"},0,0,0,0,0,null,0]
["",null,{"$f":"'Seçilen Öğretmen'!B6","v":" "},{"$f":"IF('Seçilen Öğretmen'!C6=\" \",\" \",'Seçilen Öğretmen'!C6)","v":0},{"$f":"IF('Seçilen Öğretmen'!D6=\"\",\"\",'Seçilen Öğretmen'!D6)","v":0},{"$f":"IF('Seçilen Öğretmen'!E6=\"\",\"\",'Seçilen Öğretmen'!E6)","v":0},{"$f":"IF('Seçilen Öğretmen'!F6=\"\",\"\",'Seçilen Öğretmen'!F6)","v":0},null,null,null,null,null,null,null,null,null,null,0,0,null,{"$error":"#DIV/0!"},0,0,0,0,0,null,0]
["",null,{"$f":"'Seçilen Öğretmen'!B7","v":" "},{"$f":"IF('Seçilen Öğretmen'!C7=\"\",\"\",'Seçilen Öğretmen'!C7)","v":0},{"$f":"IF('Seçilen Öğretmen'!D7=\"\",\"\",'Seçilen Öğretmen'!D7)","v":0},{"$f":"IF('Seçilen Öğretmen'!E7=\"\",\"\",'Seçilen Öğretmen'!E7)","v":0},{"$f":"IF('Seçilen Öğretmen'!F7=\"\",\"\",'Seçilen Öğretmen'!F7)","v":0},null,null,null,null,null,null,null,null,null,null,0,0,null,{"$error":"#DIV/0!"},0,0,0,0,0,null,0]
["",null,{"$f":"'Seçilen Öğretmen'!B8","v":" "},{"$f":"IF('Seçilen Öğretmen'!C8=\"\",\"\",'Seçilen Öğretmen'!C8)","v":0},{"$f":"IF('Seçilen Öğretmen'!D8=\"\",\"\",'Seçilen Öğretmen'!D8)","v":0},{"$f":"IF('Seçilen Öğretmen'!E8=\"\",\"\",'Seçilen Öğretmen'!E8)","v":0},{"$f":"IF('Seçilen Öğretmen'!F8=\"\",\"\",'Seçilen Öğretmen'!F8)","v":0},null,null,null,null,null,null,null,null,null,null,0,0,null,{"$error":"#DIV/0!"},0,0,0,0,0,null,0]
["",null,{"$f":"'Seçilen Öğretmen'!B9","v":" "},{"$f":"IF('Seçilen Öğretmen'!C9=\"\",\"\",'Seçilen Öğretmen'!C9)","v":0},{"$f":"IF('Seçilen Öğretmen'!D9=\"\",\"\",'Seçilen Öğretmen'!D9)","v":0},{"$f":"IF('Seçilen Öğretmen'!E9=\"\",\"\",'Seçilen Öğretmen'!E9)","v":0},{"$f":"IF('Seçilen Öğretmen'!F9=\"\",\"\",'Seçilen Öğretmen'!F9)","v":0},null,null,null,null,null,null,null,null,null,null,0,0,null,{"$error":"#DIV/0!"},0,0,0,0,0,null,0]
["",null,{"$f":"'Seçilen Öğretmen'!B10","v":" "},{"$f":"IF('Seçilen Öğretmen'!C10=\"\",\"\",'Seçilen Öğretmen'!C10)","v":0},{"$f":"IF('Seçilen Öğretmen'!D10=\"\",\"\",'Seçilen Öğretmen'!D10)","v":0},{"$f":"IF('Seçilen Öğretmen'!E10=\"\",\"\",'Seçilen Öğretmen'!E10)","v":0},{"$f":"IF('Seçilen Öğretmen'!F10=\"\",\"\",'Seçilen Öğretmen'!F10)","v":0},null,null,null,null,null,null,null,null,null,null,0,0,null,{"$error":"#DIV/0!"},0,0,0,0,0,null,0]
[{"$f":"IF(ISTEXT(D15),1,\"\")","v":""},null,{"$f":"'Seçilen Öğretmen'!B11","v":" "},{"$f":"IF('Seçilen Öğretmen'!C11=\"\",\"\",'Seçilen Öğretmen'!C11)","v":0},{"$f":"IF('Seçilen Öğretmen'!D11=\"\",\"\",'Seçilen Öğretmen'!D11)","v":0},{"$f":"IF('Seçilen Öğretmen'!E11=\"\",\"\",'Seçilen Öğretmen'!E11)","v":0},{"$f":"IF('Seçilen Öğretmen'!F11=\"\",\"\",'Seçilen Öğretmen'!F11)","v":0},null,null,null,null,null,null,null,null,null,null,0,{"$f":"IF(V15>0,U15,0)","v":0},null,{"$f":"ROUND(SUM(V15/Z15),2)","v":{"$error":"#DIV/0!"}},0,0,0,0,{"$f":"W15+X15+Y15+AB15","v":0},null,0]
["",null,{"$f":"'Seçilen Öğretmen'!B12","v":" "},{"$f":"IF('Seçilen Öğretmen'!C12=\"\",\"\",'Seçilen Öğretmen'!C12)","v":0},{"$f":"IF('Seçilen Öğretmen'!D12=\"\",\"\",'Seçilen Öğretmen'!D12)","v":0},{"$f":"IF('Seçilen Öğretmen'!E12=\"\",\"\",'Seçilen Öğretmen'!E12)","v":0},{"$f":"IF('Seçilen Öğretmen'!F12=\"\",\"\",'Seçilen Öğretmen'!F12)","v":0},null,null,null,null,null,null,null,null,null,null,0,0,null,{"$error":"#DIV/0!"},0,0,0,0,0,null,0]
["",null,{"$f":"'Seçilen Öğretmen'!B13","v":" "},{"$f":"IF('Seçilen Öğretmen'!C13=\"\",\"\",'Seçilen Öğretmen'!C13)","v":0},{"$f":"IF('Seçilen Öğretmen'!D13=\"\",\"\",'Seçilen Öğretmen'!D13)","v":0},{"$f":"IF('Seçilen Öğretmen'!E13=\"\",\"\",'Seçilen Öğretmen'!E13)","v":0},{"$f":"IF('Seçilen Öğretmen'!F13=\"\",\"\",'Seçilen Öğretmen'!F13)","v":0},null,null,null,null,null,null,null,null,null,null,0,0,null,{"$error":"#DIV/0!"},0,0,0,0,0,null,0]
["",null,{"$f":"'Seçilen Öğretmen'!B14","v":" "},{"$f":"IF('Seçilen Öğretmen'!C14=\"\",\"\",'Seçilen Öğretmen'!C14)","v":0},{"$f":"IF('Seçilen Öğretmen'!D14=\"\",\"\",'Seçilen Öğretmen'!D14)","v":0},{"$f":"IF('Seçilen Öğretmen'!E14=\"\",\"\",'Seçilen Öğretmen'!E14)","v":0},{"$f":"IF('Seçilen Öğretmen'!F14=\"\",\"\",'Seçilen Öğretmen'!F14)","v":0},null,null,null,null,null,null,null,null,null,null,0,0,null,{"$error":"#DIV/0!"},0,0,0,0,0,null,0]
["",null,{"$f":"'Seçilen Öğretmen'!B15","v":" "},{"$f":"IF('Seçilen Öğretmen'!C15=\"\",\"\",'Seçilen Öğretmen'!C15)","v":0},{"$f":"IF('Seçilen Öğretmen'!D15=\"\",\"\",'Seçilen Öğretmen'!D15)","v":0},{"$f":"IF('Seçilen Öğretmen'!E15=\"\",\"\",'Seçilen Öğretmen'!E15)","v":0},{"$f":"IF('Seçilen Öğretmen'!F15=\"\",\"\",'Seçilen Öğretmen'!F15)","v":0},null,null,null,null,null,null,null,null,null,null,0,0,null,{"$error":"#DIV/0!"},0,0,0,0,0,null,0]
["",null,{"$f":"'Seçilen Öğretmen'!B16","v":" "},{"$f":"IF('Seçilen Öğretmen'!C16=\"\",\"\",'Seçilen Öğretmen'!C16)","v":0},{"$f":"IF('Seçilen Öğretmen'!D16=\"\",\"\",'Seçilen Öğretmen'!D16)","v":0},{"$f":"IF('Seçilen Öğretmen'!E16=\"\",\"\",'Seçilen Öğretmen'!E16)","v":0},{"$f":"IF('Seçilen Öğretmen'!F16=\"\",\"\",'Seçilen Öğretmen'!F16)","v":0},null,null,null,null,null,null,null,null,null,null,0,0,null,{"$error":"#DIV/0!"},0,0,0,0,0,null,0]
["",null,{"$f":"'Seçilen Öğretmen'!B17","v":" "},{"$f":"IF('Seçilen Öğretmen'!C17=\"\",\"\",'Seçilen Öğretmen'!C17)","v":0},{"$f":"IF('Seçilen Öğretmen'!D17=\"\",\"\",'Seçilen Öğretmen'!D17)","v":0},{"$f":"IF('Seçilen Öğretmen'!E17=\"\",\"\",'Seçilen Öğretmen'!E17)","v":0},{"$f":"IF('Seçilen Öğretmen'!F17=\"\",\"\",'Seçilen Öğretmen'!F17)","v":0},null,null,null,null,null,null,null,null,null,null,0,0,null,{"$error":"#DIV/0!"},0,0,0,0,0,null,0]
["",null,{"$f":"'Seçilen Öğretmen'!B18","v":" "},{"$f":"IF('Seçilen Öğretmen'!C18=\"\",\"\",'Seçilen Öğretmen'!C18)","v":0},{"$f":"IF('Seçilen Öğretmen'!D18=\"\",\"\",'Seçilen Öğretmen'!D18)","v":0},{"$f":"IF('Seçilen Öğretmen'!E18=\"\",\"\",'Seçilen Öğretmen'!E18)","v":0},{"$f":"IF('Seçilen Öğretmen'!F18=\"\",\"\",'Seçilen Öğretmen'!F18)","v":0},null,null,null,null,null,null,null,null,null,null,0,0,null,{"$error":"#DIV/0!"},0,0,0,0,0,null,0]
["",null,{"$f":"'Seçilen Öğretmen'!B19","v":" "},{"$f":"IF('Seçilen Öğretmen'!C19=\"\",\"\",'Seçilen Öğretmen'!C19)","v":0},{"$f":"IF('Seçilen Öğretmen'!D19=\"\",\"\",'Seçilen Öğretmen'!D19)","v":0},{"$f":"IF('Seçilen Öğretmen'!E19=\"\",\"\",'Seçilen Öğretmen'!E19)","v":0},{"$f":"IF('Seçilen Öğretmen'!F19=\"\",\"\",'Seçilen Öğretmen'!F19)","v":0},null,null,null,null,null,null,null,null,null,null,0,0,null,{"$error":"#DIV/0!"},0,0,0,0,0,null,0]
["",null,{"$f":"'Seçilen Öğretmen'!B20","v":" "},{"$f":"IF('Seçilen Öğretmen'!C20=\"\",\"\",'Seçilen Öğretmen'!C20)","v":0},{"$f":"IF('Seçilen Öğretmen'!D20=\"\",\"\",'Seçilen Öğretmen'!D20)","v":0},{"$f":"IF('Seçilen Öğretmen'!E20=\"\",\"\",'Seçilen Öğretmen'!E20)","v":0},{"$f":"IF('Seçilen Öğretmen'!F20=\"\",\"\",'Seçilen Öğretmen'!F20)","v":0},null,null,null,null,null,null,null,null,null,null,0,0,null,{"$error":"#DIV/0!"},0,0,0,0,0,null,0]
["",null,{"$f":"'Seçilen Öğretmen'!B21","v":" "},{"$f":"IF('Seçilen Öğretmen'!C21=\"\",\"\",'Seçilen Öğretmen'!C21)","v":0},{"$f":"IF('Seçilen Öğretmen'!D21=\"\",\"\",'Seçilen Öğretmen'!D21)","v":0},{"$f":"IF('Seçilen Öğretmen'!E21=\"\",\"\",'Seçilen Öğretmen'!E21)","v":0},{"$f":"IF('Seçilen Öğretmen'!F21=\"\",\"\",'Seçilen Öğretmen'!F21)","v":0},null,null,null,null,null,null,null,null,null,null,0,0,null,{"$error":"#DIV/0!"},0,0,0,0,0,null,0]
["",null,{"$f":"'Seçilen Öğretmen'!B22","v":" "},{"$f":"IF('Seçilen Öğretmen'!C22=\"\",\"\",'Seçilen Öğretmen'!C22)","v":0},{"$f":"IF('Seçilen Öğretmen'!D22=\"\",\"\",'Seçilen Öğretmen'!D22)","v":0},{"$f":"IF('Seçilen Öğretmen'!E22=\"\",\"\",'Seçilen Öğretmen'!E22)","v":0},{"$f":"IF('Seçilen Öğretmen'!F22=\"\",\"\",'Seçilen Öğretmen'!F22)","v":0},null,null,null,null,null,null,null,null,null,null,0,0,null,{"$error":"#DIV/0!"},0,0,0,0,0,null,0]
["",null,{"$f":"'Seçilen Öğretmen'!B23","v":" "},{"$f":"IF('Seçilen Öğretmen'!C23=\"\",\"\",'Seçilen Öğretmen'!C23)","v":0},{"$f":"IF('Seçilen Öğretmen'!D23=\"\",\"\",'Seçilen Öğretmen'!D23)","v":0},{"$f":"IF('Seçilen Öğretmen'!E23=\"\",\"\",'Seçilen Öğretmen'!E23)","v":0},{"$f":"IF('Seçilen Öğretmen'!F23=\"\",\"\",'Seçilen Öğretmen'!F23)","v":0},null,null,null,null,null,null,null,null,null,null,0,0,null,{"$error":"#DIV/0!"},0,0,0,0,0,null,0]
["",null,{"$f":"'Seçilen Öğretmen'!B24","v":" "},{"$f":"IF('Seçilen Öğretmen'!C24=\"\",\"\",'Seçilen Öğretmen'!C24)","v":0},{"$f":"IF('Seçilen Öğretmen'!D24=\"\",\"\",'Seçilen Öğretmen'!D24)","v":0},{"$f":"IF('Seçilen Öğretmen'!E24=\"\",\"\",'Seçilen Öğretmen'!E24)","v":0},{"$f":"IF('Seçilen Öğretmen'!F24=\"\",\"\",'Seçilen Öğretmen'!F24)","v":0},null,null,null,null,null,null,null,null,null,null,0,0,null,{"$error":"#DIV/0!"},0,0,0,0,0,null,0]
["",null,{"$f":"'Seçilen Öğretmen'!B25","v":" "},{"$f":"IF('Seçilen Öğretmen'!C25=\"\",\"\",'Seçilen Öğretmen'!C25)","v":0},{"$f":"IF('Seçilen Öğretmen'!D25=\"\",\"\",'Seçilen Öğretmen'!D25)","v":0},{"$f":"IF('Seçilen Öğretmen'!E25=\"\",\"\",'Seçilen Öğretmen'!E25)","v":0},{"$f":"IF('Seçilen Öğretmen'!F25=\"\",\"\",'Seçilen Öğretmen'!F25)","v":0},null,null,null,null,null,null,null,null,null,null,0,0,null,{"$error":"#DIV/0!"},0,0,0,0,0,null,0]
["",null,{"$f":"'Seçilen Öğretmen'!B26","v":" "},{"$f":"IF('Seçilen Öğretmen'!C26=\"\",\"\",'Seçilen Öğretmen'!C26)","v":0},{"$f":"IF('Seçilen Öğretmen'!D26=\"\",\"\",'Seçilen Öğretmen'!D26)","v":0},{"$f":"IF('Seçilen Öğretmen'!E26=\"\",\"\",'Seçilen Öğretmen'!E26)","v":0},{"$f":"IF('Seçilen Öğretmen'!F26=\"\",\"\",'Seçilen Öğretmen'!F26)","v":0},null,null,null,null,null,null,null,null,null,null,0,0,null,{"$error":"#DIV/0!"},0,0,0,0,0,null,0]
["",null,{"$f":"'Seçilen Öğretmen'!B27","v":" "},{"$f":"IF('Seçilen Öğretmen'!C27=\"\",\"\",'Seçilen Öğretmen'!C27)","v":0},{"$f":"IF('Seçilen Öğretmen'!D27=\"\",\"\",'Seçilen Öğretmen'!D27)","v":0},{"$f":"IF('Seçilen Öğretmen'!E27=\"\",\"\",'Seçilen Öğretmen'!E27)","v":0},{"$f":"IF('Seçilen Öğretmen'!F27=\"\",\"\",'Seçilen Öğretmen'!F27)","v":0},null,null,null,null,null,null,null,null,null,null,0,0,null,{"$error":"#DIV/0!"},0,0,0,0,0,null,0]
["",null,{"$f":"'Seçilen Öğretmen'!B28","v":" "},{"$f":"IF('Seçilen Öğretmen'!C28=\"\",\"\",'Seçilen Öğretmen'!C28)","v":0},{"$f":"IF('Seçilen Öğretmen'!D28=\"\",\"\",'Seçilen Öğretmen'!D28)","v":0},{"$f":"IF('Seçilen Öğretmen'!E28=\"\",\"\",'Seçilen Öğretmen'!E28)","v":0},{"$f":"IF('Seçilen Öğretmen'!F28=\"\",\"\",'Seçilen Öğretmen'!F28)","v":0},null,null,null,null,null,null,null,null,null,null,0,0,null,{"$error":"#DIV/0!"},0,0,0,0,0,null,0]
["",null,{"$f":"'Seçilen Öğretmen'!B29","v":" "},{"$f":"IF('Seçilen Öğretmen'!C29=\"\",\"\",'Seçilen Öğretmen'!C29)","v":0},{"$f":"IF('Seçilen Öğretmen'!D29=\"\",\"\",'Seçilen Öğretmen'!D29)","v":0},{"$f":"IF('Seçilen Öğretmen'!E29=\"\",\"\",'Seçilen Öğretmen'!E29)","v":0},{"$f":"IF('Seçilen Öğretmen'!F29=\"\",\"\",'Seçilen Öğretmen'!F29)","v":0},null,null,null,null,null,null,null,null,null,null,0,0,null,{"$error":"#DIV/0!"},0,0,0,0,0,null,0]
["",null,{"$f":"'Seçilen Öğretmen'!B30","v":" "},{"$f":"IF('Seçilen Öğretmen'!C30=\"\",\"\",'Seçilen Öğretmen'!C30)","v":0},{"$f":"IF('Seçilen Öğretmen'!D30=\"\",\"\",'Seçilen Öğretmen'!D30)","v":0},{"$f":"IF('Seçilen Öğretmen'!E30=\"\",\"\",'Seçilen Öğretmen'!E30)","v":0},{"$f":"IF('Seçilen Öğretmen'!F30=\"\",\"\",'Seçilen Öğretmen'!F30)","v":0},null,null,null,null,null,null,null,null,null,null,0,0,null,{"$error":"#DIV/0!"},0,0,0,0,0,null,0]
["",null,{"$f":"'Seçilen Öğretmen'!B31","v":" "},{"$f":"IF('Seçilen Öğretmen'!C31=\"\",\"\",'Seçilen Öğretmen'!C31)","v":0},{"$f":"IF('Seçilen Öğretmen'!D31=\"\",\"\",'Seçilen Öğretmen'!D31)","v":0},{"$f":"IF('Seçilen Öğretmen'!E31=\"\",\"\",'Seçilen Öğretmen'!E31)","v":0},{"$f":"IF('Seçilen Öğretmen'!F31=\"\",\"\",'Seçilen Öğretmen'!F31)","v":0},null,null,null,null,null,null,null,null,null,null,0,0,null,{"$error":"#DIV/0!"},0,0,0,0,0,null,0]
["",null,{"$f":"'Seçilen Öğretmen'!B32","v":" "},{"$f":"IF('Seçilen Öğretmen'!C32=\"\",\"\",'Seçilen Öğretmen'!C32)","v":0},{"$f":"IF('Seçilen Öğretmen'!D32=\"\",\"\",'Seçilen Öğretmen'!D32)","v":0},{"$f":"IF('Seçilen Öğretmen'!E32=\"\",\"\",'Seçilen Öğretmen'!E32)","v":0},{"$f":"IF('Seçilen Öğretmen'!F32=\"\",\"\",'Seçilen Öğretmen'!F32)","v":0},null,null,null,null,null,null,null,null,null,null,0,0,null,{"$error":"#DIV/0!"},0,0,0,0,0,null,0]
["",null,{"$f":"'Seçilen Öğretmen'!B33","v":" "},{"$f":"IF('Seçilen Öğretmen'!C33=\"\",\"\",'Seçilen Öğretmen'!C33)","v":0},{"$f":"IF('Seçilen Öğretmen'!D33=\"\",\"\",'Seçilen Öğretmen'!D33)","v":0},{"$f":"IF('Seçilen Öğretmen'!E33=\"\",\"\",'Seçilen Öğretmen'!E33)","v":0},{"$f":"IF('Seçilen Öğretmen'!F33=\"\",\"\",'Seçilen Öğretmen'!F33)","v":0},null,null,null,null,null,null,null,null,null,null,0,0,null,{"$error":"#DIV/0!"},0,0,0,0,0,null,0]
["",null,{"$f":"'Seçilen Öğretmen'!B34","v":" "},{"$f":"IF('Seçilen Öğretmen'!C34=\"\",\"\",'Seçilen Öğretmen'!C34)","v":0},{"$f":"IF('Seçilen Öğretmen'!D34=\"\",\"\",'Seçilen Öğretmen'!D34)","v":0},{"$f":"IF('Seçilen Öğretmen'!E34=\"\",\"\",'Seçilen Öğretmen'!E34)","v":0},{"$f":"IF('Seçilen Öğretmen'!F34=\"\",\"\",'Seçilen Öğretmen'!F34)","v":0},null,null,null,null,null,null,null,null,null,null,0,0,null,{"$error":"#DIV/0!"},0,0,0,0,0,null,0]
["",null,{"$f":"'Seçilen Öğretmen'!B35","v":" "},{"$f":"IF('Seçilen Öğretmen'!C35=\"\",\"\",'Seçilen Öğretmen'!C35)","v":0},{"$f":"IF('Seçilen Öğretmen'!D35=\"\",\"\",'Seçilen Öğretmen'!D35)","v":0},{"$f":"IF('Seçilen Öğretmen'!E35=\"\",\"\",'Seçilen Öğretmen'!E35)","v":0},{"$f":"IF('Seçilen Öğretmen'!F35=\"\",\"\",'Seçilen Öğretmen'!F35)","v":0},null,null,null,null,null,null,null,null,null,null,0,0,null,{"$error":"#DIV/0!"},0,0,0,0,0,null,0]
["",null,{"$f":"'Seçilen Öğretmen'!B36","v":" "},{"$f":"IF('Seçilen Öğretmen'!C36=\"\",\"\",'Seçilen Öğretmen'!C36)","v":0},{"$f":"IF('Seçilen Öğretmen'!D36=\"\",\"\",'Seçilen Öğretmen'!D36)","v":0},{"$f":"IF('Seçilen Öğretmen'!E36=\"\",\"\",'Seçilen Öğretmen'!E36)","v":0},{"$f":"IF('Seçilen Öğretmen'!F36=\"\",\"\",'Seçilen Öğretmen'!F36)","v":0},null,null,null,null,null,null,null,null,null,null,0,0,null,{"$error":"#DIV/0!"},0,0,0,0,0,null,0]
["",null,{"$f":"'Seçilen Öğretmen'!B37","v":" "},{"$f":"IF('Seçilen Öğretmen'!C37=\"\",\"\",'Seçilen Öğretmen'!C37)","v":0},{"$f":"IF('Seçilen Öğretmen'!D37=\"\",\"\",'Seçilen Öğretmen'!D37)","v":0},{"$f":"IF('Seçilen Öğretmen'!E37=\"\",\"\",'Seçilen Öğretmen'!E37)","v":0},{"$f":"IF('Seçilen Öğretmen'!F37=\"\",\"\",'Seçilen Öğretmen'!F37)","v":0},null,null,null,null,null,null,null,null,null,null,0,0,null,{"$error":"#DIV/0!"},0,0,0,0,0,null,0]
["",null,{"$f":"'Seçilen Öğretmen'!B38","v":" "},{"$f":"IF('Seçilen Öğretmen'!C38=\"\",\"\",'Seçilen Öğretmen'!C38)","v":0},{"$f":"IF('Seçilen Öğretmen'!D38=\"\",\"\",'Seçilen Öğretmen'!D38)","v":0},{"$f":"IF('Seçilen Öğretmen'!E38=\"\",\"\",'Seçilen Öğretmen'!E38)","v":0},{"$f":"IF('Seçilen Öğretmen'!F38=\"\",\"\",'Seçilen Öğretmen'!F38)","v":0},null,null,null,null,null,null,null,null,null,null,0,0,null,{"$error":"#DIV/0!"},0,0,0,0,0,null,0]
["",null,{"$f":"'Seçilen Öğretmen'!B39","v":" "},{"$f":"IF('Seçilen Öğretmen'!C39=\"\",\"\",'Seçilen Öğretmen'!C39)","v":0},{"$f":"IF('Seçilen Öğretmen'!D39=\"\",\"\",'Seçilen Öğretmen'!D39)","v":0},{"$f":"IF('Seçilen Öğretmen'!E39=\"\",\"\",'Seçilen Öğretmen'!E39)","v":0},{"$f":"IF('Seçilen Öğretmen'!F39=\"\",\"\",'Seçilen Öğretmen'!F39)","v":0},null,null,null,null,null,null,null,null,null,null,0,0,null,{"$error":"#DIV/0!"},0,0,0,0,0,null,0]
["",null,{"$f":"'Seçilen Öğretmen'!B40","v":" "},{"$f":"IF('Seçilen Öğretmen'!C40=\"\",\"\",'Seçilen Öğretmen'!C40)","v":0},{"$f":"IF('Seçilen Öğretmen'!D40=\"\",\"\",'Seçilen Öğretmen'!D40)","v":0},{"$f":"IF('Seçilen Öğretmen'!E40=\"\",\"\",'Seçilen Öğretmen'!E40)","v":0},{"$f":"IF('Seçilen Öğretmen'!F40=\"\",\"\",'Seçilen Öğretmen'!F40)","v":0},null,null,null,null,null,null,null,null,null,null,0,0,null,{"$error":"#DIV/0!"},0,0,0,0,0,null,0]
["",null,{"$f":"'Seçilen Öğretmen'!B41","v":" "},{"$f":"IF('Seçilen Öğretmen'!C41=\"\",\"\",'Seçilen Öğretmen'!C41)","v":0},{"$f":"IF('Seçilen Öğretmen'!D41=\"\",\"\",'Seçilen Öğretmen'!D41)","v":0},{"$f":"IF('Seçilen Öğretmen'!E41=\"\",\"\",'Seçilen Öğretmen'!E41)","v":0},{"$f":"IF('Seçilen Öğretmen'!F41=\"\",\"\",'Seçilen Öğretmen'!F41)","v":0},null,null,null,null,null,null,null,null,null,null,0,0,null,{"$error":"#DIV/0!"},0,0,0,0,0,null,0]
["",null,{"$f":"'Seçilen Öğretmen'!B42","v":" "},{"$f":"IF('Seçilen Öğretmen'!C42=\"\",\"\",'Seçilen Öğretmen'!C42)","v":0},{"$f":"IF('Seçilen Öğretmen'!D42=\"\",\"\",'Seçilen Öğretmen'!D42)","v":0},{"$f":"IF('Seçilen Öğretmen'!E42=\"\",\"\",'Seçilen Öğretmen'!E42)","v":0},{"$f":"IF('Seçilen Öğretmen'!F42=\"\",\"\",'Seçilen Öğretmen'!F42)","v":0},null,null,null,null,null,null,null,null,null,null,0,0,null,{"$error":"#DIV/0!"},0,0,0,0,0,null,0]
["",null,null,null,null,null,null,null,null,null,null,null,null,null,null,null,null,0,0,null,{"$error":"#DIV/0!"},0,0,0,0,0,null,0]
[null,null,{"$f":"Anasayfa!C7&\" \"&\"EĞİTİM-ÖĞRETİM YILI\"","v":"2017-2018 EĞİTİM-ÖĞRETİM YILI"},null,null,null,"………………………..……………………………………………………………………",null,null,null,null,null,null,null,null,null,"DERSLERİNDEN"]
[null,null,"PROJE ÇALIŞMASI YAPAN ÖĞRENCİLERİN DEĞERLENDİRME SONUÇLARI YUKARIDAKİ TABLODA GÖSTERİLMİŞTİR."]
[null,null,null,null,null,null,null,null,null,null,null,"…../…../2017"]
[]
[null,null,null,null,null,null,null,null,null,null,null,{"$f":"Anasayfa!C5","v":"EBRU BUSE GÜDER"}]
[null,null,null,null,null,null,null,null,null,null,null,{"$f":"Anasayfa!C6&\" \"&\"ÖĞRETMENİ\"","v":"İNGİLİZCE ÖĞRETMENİ"}]

{"sheet":"Öğrenci Listeleri","index":2,"n_rows":882,"n_cols":12,"rows_kept":882,"cut":false,"hidden":false,"merged":[[842,6,881,6],[522,6,561,6],[562,6,601,6],[602,6,641,6],[642,6,681,6],[682,6,721,6],[802,6,841,6],[2,6,41,6],[42,6,81,6],[82,6,121,6],[122,6,161,6],[162,6,201,6],[202,6,241,6],[242,6,281,6],[282,6,321,6],[322,6,361,6],[362,6,401,6],[402,6,441,6],[442,6,481,6],[722,6,761,6],[762,6,801,6],[482,6,521,6]]}
[]
[null,"S.No","DERS","SINIFI","NO","ADI SOYADI"]
[null,1,null,null,null,null,{"$f":"K4","v":"EBRU BUSE GÜDER"},null,null,null,"Sınıf İsmi"]
[null,2,null,null,null,null,null,null,null,null,{"$f":"IF(Kaynaklarımız!C3=0,\" \",Kaynaklarımız!C3)","v":"EBRU BUSE GÜDER"},{"$f":"Kaynaklarımız!B3","v":1}]
[null,3,null,null,null,null,null,null,null,null,{"$f":"IF(Kaynaklarımız!C4=0,\" \",Kaynaklarımız!C4)","v":"DÖNDÜ ÜNAL"},{"$f":"Kaynaklarımız!B4","v":2}]
[null,4,null,null,null,null,null,null,null,null,{"$f":"IF(Kaynaklarımız!C5=0,\" \",Kaynaklarımız!C5)","v":"GÖKHAN EKER"},{"$f":"Kaynaklarımız!B5","v":3}]
[null,5,null,null,null,null,null,null,null,null,{"$f":"IF(Kaynaklarımız!C6=0,\" \",Kaynaklarımız!C6)","v":"METİN ÖNDER"},{"$f":"Kaynaklarımız!B6","v":4}]
[null,6,null,null,null,null,null,null,null,null,{"$f":"IF(Kaynaklarımız!C7=0,\" \",Kaynaklarımız!C7)","v":"LEVENT DEMİR"},{"$f":"Kaynaklarımız!B7","v":5}]
[null,7,null,null,null,null,null,null,null,null,{"$f":"IF(Kaynaklarımız!C8=0,\" \",Kaynaklarımız!C8)","v":"HÜRKAN METE"},{"$f":"Kaynaklarımız!B8","v":6}]
[null,8,null,null,null,null,null,null,null,null,{"$f":"IF(Kaynaklarımız!C9=0,\" \",Kaynaklarımız!C9)","v":"AHMET FURKAN GÜNEŞ"},{"$f":"Kaynaklarımız!B9","v":7}]
[null,9,null,null,null,null,null,null,null,null,{"$f":"IF(Kaynaklarımız!C10=0,\" \",Kaynaklarımız!C10)","v":"ESRA KAYAR"},{"$f":"Kaynaklarımız!B10","v":8}]
[null,10,null,null,null,null,null,null,null,null,{"$f":"IF(Kaynaklarımız!C11=0,\" \",Kaynaklarımız!C11)","v":"SEHURE CAN"},{"$f":"Kaynaklarımız!B11","v":9}]
[null,11,null,null,null,null,null,null,null,null,{"$f":"IF(Kaynaklarımız!C12=0,\" \",Kaynaklarımız!C12)","v":"FATİH ÇALHAN"},{"$f":"Kaynaklarımız!B12","v":10}]
[null,12,null,null,null,null,null,null,null,null,{"$f":"IF(Kaynaklarımız!C13=0,\" \",Kaynaklarımız!C13)","v":"BİRGÜL IRMAK"},{"$f":"Kaynaklarımız!B13","v":11}]
[null,13,null,null,null,null,null,null,null,null,{"$f":"IF(Kaynaklarımız!C14=0,\" \",Kaynaklarımız!C14)","v":"MUHAMMET YILMAZ"},{"$f":"Kaynaklarımız!B14","v":12}]
[null,14,null,null,null,null,null,null,null,null,{"$f":"IF(Kaynaklarımız!C15=0,\" \",Kaynaklarımız!C15)","v":"SEHURE CAN"},{"$f":"Kaynaklarımız!B15","v":13}]
[null,15,null,null,null,null,null,null,null,null,{"$f":"IF(Kaynaklarımız!C16=0,\" \",Kaynaklarımız!C16)","v":"ABDULLAH ŞENGÖNÜL"},{"$f":"Kaynaklarımız!B16","v":14}]
[null,16,null,null,null,null,null,null,null,null,{"$f":"IF(Kaynaklarımız!C17=0,\" \",Kaynaklarımız!C17)","v":"FATMA ÇAKMAK"},{"$f":"Kaynaklarımız!B17","v":15}]
[null,17,null,null,null,null,null,null,null,null,{"$f":"IF(Kaynaklarımız!C18=0,\" \",Kaynaklarımız!C18)","v":" "},{"$f":"Kaynaklarımız!B18","v":16}]
[null,18,null,null,null,null,null,null,null,null,{"$f":"IF(Kaynaklarımız!C19=0,\" \",Kaynaklarımız!C19)","v":" "},{"$f":"Kaynaklarımız!B19","v":17}]
[null,19,null,null,null,null,null,null,null,null,{"$f":"IF(Kaynaklarımız!C20=0,\" \",Kaynaklarımız!C20)","v":" "},{"$f":"Kaynaklarımız!B20","v":18}]
[null,20,null,null,null,null,null,null,null,null,{"$f":"IF(Kaynaklarımız!C21=0,\" \",Kaynaklarımız!C21)","v":" "},{"$f":"Kaynaklarımız!B21","v":19}]
[null,21,null,null,null,null,null,null,null,null,{"$f":"IF(Kaynaklarımız!C22=0,\" \",Kaynaklarımız!C22)","v":" "},{"$f":"Kaynaklarımız!B22","v":20}]
[null,22,null,null,null,null,null,null,null,null,{"$f":"IF(Kaynaklarımız!C23=0,\" \",Kaynaklarımız!C23)","v":" "},{"$f":"Kaynaklarımız!B23","v":21}]
[null,23,null,null,null,null,null,null,null,null,{"$f":"IF(Kaynaklarımız!C24=0,\" \",Kaynaklarımız!C24)","v":" "},841]
[null,24]
[null,25]
[null,26]
[null,27]
[null,28]
[null,29]
[null,30]
[null,31]
[null,32]
[null,33]
[null,34]
[null,35]
[null,36]
[null,37]
[null,38]
[null,39]
[null,40]
[null,41,null,null,null,null,{"$f":"K5","v":"DÖNDÜ ÜNAL"}]
[null,42]
[null,43]
[null,44]
[null,45]
[null,46]
[null,47]
[null,48]
[null,49]
[null,50]
[null,51]
[null,52]
[null,53]
[null,54]
[null,55]
[null,56]
[null,57]
[null,58]
[null,59]
[null,60]
[null,61]
[null,62]
[null,63]
[null,64]
[null,65]
[null,66]
[null,67]
[null,68]
[null,69]
[null,70]
[null,71]
[null,72]
[null,73]
[null,74]
[null,75]
[null,76]
[null,77]
[null,78]
[null,79]
[null,80]
[null,81,null,null,null,null,{"$f":"K6","v":"GÖKHAN EKER"}]
[null,82]
[null,83]
[null,84]
[null,85]
[null,86]
[null,87]
[null,88]
[null,89]
[null,90]
[null,91]
[null,92]
[null,93]
[null,94]
[null,95]
[null,96]
[null,97]
[null,98]
[null,99]
[null,100]
[null,101]
[null,102]
[null,103]
[null,104]
[null,105]
[null,106]
[null,107]
[null,108]
[null,109]
[null,110]
[null,111]
[null,112]
[null,113]
[null,114]
[null,115]
[null,116]
[null,117]
[null,118]
[null,119]
[null,120]
[null,121,null,null,null,null,{"$f":"K7","v":"METİN ÖNDER"}]
[null,122]
[null,123]
[null,124]
[null,125]
[null,126]
[null,127]
[null,128]
[null,129]
[null,130]
[null,131]
[null,132]
[null,133]
[null,134]
[null,135]
[null,136]
[null,137]
[null,138]
[null,139]
[null,140]
[null,141]
[null,142]
[null,143]
[null,144]
[null,145]
[null,146]
[null,147]
[null,148]
[null,149]
[null,150]
[null,151]
[null,152]
[null,153]
[null,154]
[null,155]
[null,156]
[null,157]
[null,158]
[null,159]
[null,160]
[null,161,null,null,null,null,{"$f":"K8","v":"LEVENT DEMİR"}]
[null,162]
[null,163]
[null,164]
[null,165]
[null,166]
[null,167]
[null,168]
[null,169]
[null,170]
[null,171]
[null,172]
[null,173]
[null,174]
[null,175]
[null,176]
[null,177]
[null,178]
[null,179]
[null,180]
[null,181]
[null,182]
[null,183]
[null,184]
[null,185]
[null,186]
[null,187]
[null,188]
[null,189]
[null,190]
[null,191]
[null,192]
[null,193]
[null,194]
[null,195]
[null,196]
[null,197]
[null,198]
[null,199]
[null,200]
[null,201,null,null,null,null,{"$f":"K9","v":"HÜRKAN METE"}]
[null,202]
[null,203]
[null,204]
[null,205]
[null,206]
[null,207]
[null,208]
[null,209]
[null,210]
[null,211]
[null,212]
[null,213]
[null,214]
[null,215]
[null,216]
[null,217]
[null,218]
[null,219]
[null,220]
[null,221]
[null,222]
[null,223]
[null,224]
[null,225]
[null,226]
[null,227]
[null,228]
[null,229]
[null,230]
[null,231]
[null,232]
[null,233]
[null,234]
[null,235]
[null,236]
[null,237]
[null,238]
[null,239]
[null,240]
[null,241,null,null,null,null,{"$f":"K10","v":"AHMET FURKAN GÜNEŞ"}]
[null,242]
[null,243]
[null,244]
[null,245]
[null,246]
[null,247]
[null,248]
[null,249]
[null,250]
[null,251]
[null,252]
[null,253]
[null,254]
[null,255]
[null,256]
[null,257]
[null,258]
[null,259]
[null,260]
[null,261]
[null,262]
[null,263]
[null,264]
[null,265]
[null,266]
[null,267]
[null,268]
[null,269]
[null,270]
[null,271]
[null,272]
[null,273]
[null,274]
[null,275]
[null,276]
[null,277]
[null,278]
[null,279]
[null,280]
[null,281,null,null,null,null,{"$f":"K11","v":"ESRA KAYAR"}]
[null,282]
[null,283]
[null,284]
[null,285]
[null,286]
[null,287]
[null,288]
[null,289]
[null,290]
[null,291]
[null,292]
[null,293]
[null,294]
[null,295]
[null,296]
[null,297]
[null,298]
[null,299]
[null,300]
[null,301]
[null,302]
[null,303]
[null,304]
[null,305]
[null,306]
[null,307]
[null,308]
[null,309]
[null,310]
[null,311]
[null,312]
[null,313]
[null,314]
[null,315]
[null,316]
[null,317]
[null,318]
[null,319]
[null,320]
[null,321,null,null,null,null,{"$f":"K12","v":"SEHURE CAN"}]
[null,322]
[null,323]
[null,324]
[null,325]
[null,326]
[null,327]
[null,328]
[null,329]
[null,330]
[null,331]
[null,332]
[null,333]
[null,334]
[null,335]
[null,336]
[null,337]
[null,338]
[null,339]
[null,340]
[null,341]
[null,342]
[null,343]
[null,344]
[null,345]
[null,346]
[null,347]
[null,348]
[null,349]
[null,350]
[null,351]
[null,352]
[null,353]
[null,354]
[null,355]
[null,356]
[null,357]
[null,358]
[null,359]
[null,360]
[null,361,null,null,null,null,{"$f":"K13","v":"FATİH ÇALHAN"}]
[null,362]
[null,363]
[null,364]
[null,365]
[null,366]
[null,367]
[null,368]
[null,369]
[null,370]
[null,371]
[null,372]
[null,373]
[null,374]
[null,375]
[null,376]
[null,377]
[null,378]
[null,379]
[null,380]
[null,381]
[null,382]
[null,383]
[null,384]
[null,385]
[null,386]
[null,387]
[null,388]
[null,389]
[null,390]
[null,391]
[null,392]
[null,393]
[null,394]
[null,395]
[null,396]
[null,397]
[null,398]
[null,399]
[null,400]
[null,401,null,null,null,null,{"$f":"K14","v":"BİRGÜL IRMAK"}]
[null,402]
[null,403]
[null,404]
[null,405]
[null,406]
[null,407]
[null,408]
[null,409]
[null,410]
[null,411]
[null,412]
[null,413]
[null,414]
[null,415]
[null,416]
[null,417]
[null,418]
[null,419]
[null,420]
[null,421]
[null,422]
[null,423]
[null,424]
[null,425]
[null,426]
[null,427]
[null,428]
[null,429]
[null,430]
[null,431]
[null,432]
[null,433]
[null,434]
[null,435]
[null,436]
[null,437]
[null,438]
[null,439]
[null,440]
[null,441,null,null,null,null,{"$f":"K15","v":"MUHAMMET YILMAZ"}]
[null,442]
[null,443]
[null,444]
[null,445]
[null,446]
[null,447]
[null,448]
[null,449]
[null,450]
[null,451]
[null,452]
[null,453]
[null,454]
[null,455]
[null,456]
[null,457]
[null,458]
[null,459]
[null,460]
[null,461]
[null,462]
[null,463]
[null,464]
[null,465]
[null,466]
[null,467]
[null,468]
[null,469]
[null,470]
[null,471]
[null,472]
[null,473]
[null,474]
[null,475]
[null,476]
[null,477]
[null,478]
[null,479]
[null,480]
[null,481,null,null,null,null,{"$f":"K16","v":"SEHURE CAN"}]
[null,482]
[null,483]
[null,484]
[null,485]
[null,486]
[null,487]
[null,488]
[null,489]
[null,490]
[null,491]
[null,492]
[null,493]
[null,494]
[null,495]
[null,496]
[null,497]
[null,498]
[null,499]
[null,500]
[null,501]
[null,502]
[null,503]
[null,504]
[null,505]
[null,506]
[null,507]
[null,508]
[null,509]
[null,510]
[null,511]
[null,512]
[null,513]
[null,514]
[null,515]
[null,516]
[null,517]
[null,518]
[null,519]
[null,520]
[null,521,null,null,null,null,{"$f":"K17","v":"ABDULLAH ŞENGÖNÜL"}]
[null,522]
[null,523]
[null,524]
[null,525]
[null,526]
[null,527]
[null,528]
[null,529]
[null,530]
[null,531]
[null,532]
[null,533]
[null,534]
[null,535]
[null,536]
[null,537]
[null,538]
[null,539]
[null,540]
[null,541]
[null,542]
[null,543]
[null,544]
[null,545]
[null,546]
[null,547]
[null,548]
[null,549]
[null,550]
[null,551]
[null,552]
[null,553]
[null,554]
[null,555]
[null,556]
[null,557]
[null,558]
[null,559]
[null,560]
[null,561,null,null,null,null,{"$f":"K18","v":"FATMA ÇAKMAK"}]
[null,562]
[null,563]
[null,564]
[null,565]
[null,566]
[null,567]
[null,568]
[null,569]
[null,570]
[null,571]
[null,572]
[null,573]
[null,574]
[null,575]
[null,576]
[null,577]
[null,578]
[null,579]
[null,580]
[null,581]
[null,582]
[null,583]
[null,584]
[null,585]
[null,586]
[null,587]
[null,588]
[null,589]
[null,590]
[null,591]
[null,592]
[null,593]
[null,594]
[null,595]
[null,596]
[null,597]
[null,598]
[null,599]
[null,600]
[null,601,null,null,null,null,{"$f":"K19","v":" "}]
[null,602]
[null,603]
[null,604]
[null,605]
[null,606]
[null,607]
[null,608]
[null,609]
[null,610]
[null,611]
[null,612]
[null,613]
[null,614]
[null,615]
[null,616]
[null,617]
[null,618]
[null,619]
[null,620]
[null,621]
[null,622]
[null,623]
[null,624]
[null,625]
[null,626]
[null,627]
[null,628]
[null,629]
[null,630]
[null,631]
[null,632]
[null,633]
[null,634]
[null,635]
[null,636]
[null,637]
[null,638]
[null,639]
[null,640]
[null,641,null,null,null,null,{"$f":"K20","v":" "}]
[null,642]
[null,643]
[null,644]
[null,645]
[null,646]
[null,647]
[null,648]
[null,649]
[null,650]
[null,651]
[null,652]
[null,653]
[null,654]
[null,655]
[null,656]
[null,657]
[null,658]
[null,659]
[null,660]
[null,661]
[null,662]
[null,663]
[null,664]
[null,665]
[null,666]
[null,667]
[null,668]
[null,669]
[null,670]
[null,671]
[null,672]
[null,673]
[null,674]
[null,675]
[null,676]
[null,677]
[null,678]
[null,679]
[null,680]
[null,681,null,null,null,null,{"$f":"K21","v":" "}]
[null,682]
[null,683]
[null,684]
[null,685]
[null,686]
[null,687]
[null,688]
[null,689]
[null,690]
[null,691]
[null,692]
[null,693]
[null,694]
[null,695]
[null,696]
[null,697]
[null,698]
[null,699]
[null,700]
[null,701]
[null,702]
[null,703]
[null,704]
[null,705]
[null,706]
[null,707]
[null,708]
[null,709]
[null,710]
[null,711]
[null,712]
[null,713]
[null,714]
[null,715]
[null,716]
[null,717]
[null,718]
[null,719]
[null,720]
[null,721,null,null,null,null,{"$f":"K22","v":" "}]
[null,722]
[null,723]
[null,724]
[null,725]
[null,726]
[null,727]
[null,728]
[null,729]
[null,730]
[null,731]
[null,732]
[null,733]
[null,734]
[null,735]
[null,736]
[null,737]
[null,738]
[null,739]
[null,740]
[null,741]
[null,742]
[null,743]
[null,744]
[null,745]
[null,746]
[null,747]
[null,748]
[null,749]
[null,750]
[null,751]
[null,752]
[null,753]
[null,754]
[null,755]
[null,756]
[null,757]
[null,758]
[null,759]
[null,760]
[null,761,null,null,null,null,{"$f":"K23","v":" "}]
[null,762]
[null,763]
[null,764]
[null,765]
[null,766]
[null,767]
[null,768]
[null,769]
[null,770]
[null,771]
[null,772]
[null,773]
[null,774]
[null,775]
[null,776]
[null,777]
[null,778]
[null,779]
[null,780]
[null,781]
[null,782]
[null,783]
[null,784]
[null,785]
[null,786]
[null,787]
[null,788]
[null,789]
[null,790]
[null,791]
[null,792]
[null,793]
[null,794]
[null,795]
[null,796]
[null,797]
[null,798]
[null,799]
[null,800]
[null,801,null,null,null,null,{"$f":"K24","v":" "}]
[null,802]
[null,803]
[null,804]
[null,805]
[null,806]
[null,807]
[null,808]
[null,809]
[null,810]
[null,811]
[null,812]
[null,813]
[null,814]
[null,815]
[null,816]
[null,817]
[null,818]
[null,819]
[null,820]
[null,821]
[null,822]
[null,823]
[null,824]
[null,825]
[null,826]
[null,827]
[null,828]
[null,829]
[null,830]
[null,831]
[null,832]
[null,833]
[null,834]
[null,835]
[null,836]
[null,837]
[null,838]
[null,839]
[null,840]
[null,841,null,null,null,null,{"$f":"K25","v":" "}]
[null,842]
[null,843]
[null,844]
[null,845]
[null,846]
[null,847]
[null,848]
[null,849]
[null,850]
[null,851]
[null,852]
[null,853]
[null,854]
[null,855]
[null,856]
[null,857]
[null,858]
[null,859]
[null,860]
[null,861]
[null,862]
[null,863]
[null,864]
[null,865]
[null,866]
[null,867]
[null,868]
[null,869]
[null,870]
[null,871]
[null,872]
[null,873]
[null,874]
[null,875]
[null,876]
[null,877]
[null,878]
[null,879]
[null,880]

{"sheet":"Seçilen Öğretmen","index":3,"n_rows":42,"n_cols":6,"rows_kept":42,"cut":false,"hidden":true,"merged":[]}
[]
["NO","S.NO","DERS","SINIFI","NO","ADI SOYADI"]
[{"$f":"VLOOKUP(Anasayfa!C5,'Öğrenci Listeleri'!$K$4:$L$32,2,0)","v":1},{"$f":"IF(C3>0,1,\" \")","v":" "},{"$f":"IF(A3<>\"\",VLOOKUP($A3,'Öğrenci Listeleri'!B:F,2),\"\")","v":0},{"$f":"IF(C3<>\"\",VLOOKUP($A3,'Öğrenci Listeleri'!B:F,3),\"\")","v":0},{"$f":"IF(C3<>\"\",VLOOKUP($A3,'Öğrenci Listeleri'!B:F,4),\"\")","v":0},{"$f":"IF(C3<>\"\",VLOOKUP($A3,'Öğrenci Listeleri'!B:F,5),\"\")","v":0}]
[{"$f":"A3+1","v":2},{"$f":"IF(C4>0,B3+1,\" \")","v":" "},{"$f":"IF(A4<>\"\",VLOOKUP($A4,'Öğrenci Listeleri'!B:F,2),\"\")","v":0},{"$f":"IF(C4<>\"\",VLOOKUP($A4,'Öğrenci Listeleri'!B:F,3),\"\")","v":0},{"$f":"IF(C4<>\"\",VLOOKUP($A4,'Öğrenci Listeleri'!B:F,4),\"\")","v":0},{"$f":"IF(C4<>\"\",VLOOKUP($A4,'Öğrenci Listeleri'!B:F,5),\"\")","v":0}]
[{"$f":"A4+1","v":3},{"$f":"IF(C5>0,B4+1,\" \")","v":" "},{"$f":"IF(A5<>\"\",VLOOKUP($A5,'Öğrenci Listeleri'!B:F,2),\"\")","v":0},{"$f":"IF(C5<>\"\",VLOOKUP($A5,'Öğrenci Listeleri'!B:F,3),\"\")","v":0},{"$f":"IF(C5<>\"\",VLOOKUP($A5,'Öğrenci Listeleri'!B:F,4),\"\")","v":0},{"$f":"IF(C5<>\"\",VLOOKUP($A5,'Öğrenci Listeleri'!B:F,5),\"\")","v":0}]
[4," ",{"$f":"IF(A6<>\"\",VLOOKUP($A6,'Öğrenci Listeleri'!B:F,2),\"\")","v":0},{"$f":"IF(C6<>\"\",VLOOKUP($A6,'Öğrenci Listeleri'!B:F,3),\"\")","v":0},{"$f":"IF(C6<>\"\",VLOOKUP($A6,'Öğrenci Listeleri'!B:F,4),\"\")","v":0},{"$f":"IF(C6<>\"\",VLOOKUP($A6,'Öğrenci Listeleri'!B:F,5),\"\")","v":0}]
[5," ",{"$f":"IF(A7<>\"\",VLOOKUP($A7,'Öğrenci Listeleri'!B:F,2),\"\")","v":0},{"$f":"IF(C7<>\"\",VLOOKUP($A7,'Öğrenci Listeleri'!B:F,3),\"\")","v":0},{"$f":"IF(C7<>\"\",VLOOKUP($A7,'Öğrenci Listeleri'!B:F,4),\"\")","v":0},{"$f":"IF(C7<>\"\",VLOOKUP($A7,'Öğrenci Listeleri'!B:F,5),\"\")","v":0}]
[6," ",{"$f":"IF(A8<>\"\",VLOOKUP($A8,'Öğrenci Listeleri'!B:F,2),\"\")","v":0},{"$f":"IF(C8<>\"\",VLOOKUP($A8,'Öğrenci Listeleri'!B:F,3),\"\")","v":0},{"$f":"IF(C8<>\"\",VLOOKUP($A8,'Öğrenci Listeleri'!B:F,4),\"\")","v":0},{"$f":"IF(C8<>\"\",VLOOKUP($A8,'Öğrenci Listeleri'!B:F,5),\"\")","v":0}]
[7," ",{"$f":"IF(A9<>\"\",VLOOKUP($A9,'Öğrenci Listeleri'!B:F,2),\"\")","v":0},{"$f":"IF(C9<>\"\",VLOOKUP($A9,'Öğrenci Listeleri'!B:F,3),\"\")","v":0},{"$f":"IF(C9<>\"\",VLOOKUP($A9,'Öğrenci Listeleri'!B:F,4),\"\")","v":0},{"$f":"IF(C9<>\"\",VLOOKUP($A9,'Öğrenci Listeleri'!B:F,5),\"\")","v":0}]
[8," ",{"$f":"IF(A10<>\"\",VLOOKUP($A10,'Öğrenci Listeleri'!B:F,2),\"\")","v":0},{"$f":"IF(C10<>\"\",VLOOKUP($A10,'Öğrenci Listeleri'!B:F,3),\"\")","v":0},{"$f":"IF(C10<>\"\",VLOOKUP($A10,'Öğrenci Listeleri'!B:F,4),\"\")","v":0},{"$f":"IF(C10<>\"\",VLOOKUP($A10,'Öğrenci Listeleri'!B:F,5),\"\")","v":0}]
[9," ",{"$f":"IF(A11<>\"\",VLOOKUP($A11,'Öğrenci Listeleri'!B:F,2),\"\")","v":0},{"$f":"IF(C11<>\"\",VLOOKUP($A11,'Öğrenci Listeleri'!B:F,3),\"\")","v":0},{"$f":"IF(C11<>\"\",VLOOKUP($A11,'Öğrenci Listeleri'!B:F,4),\"\")","v":0},{"$f":"IF(C11<>\"\",VLOOKUP($A11,'Öğrenci Listeleri'!B:F,5),\"\")","v":0}]
[10," ",{"$f":"IF(A12<>\"\",VLOOKUP($A12,'Öğrenci Listeleri'!B:F,2),\"\")","v":0},{"$f":"IF(C12<>\"\",VLOOKUP($A12,'Öğrenci Listeleri'!B:F,3),\"\")","v":0},{"$f":"IF(C12<>\"\",VLOOKUP($A12,'Öğrenci Listeleri'!B:F,4),\"\")","v":0},{"$f":"IF(C12<>\"\",VLOOKUP($A12,'Öğrenci Listeleri'!B:F,5),\"\")","v":0}]
[11," ",{"$f":"IF(A13<>\"\",VLOOKUP($A13,'Öğrenci Listeleri'!B:F,2),\"\")","v":0},{"$f":"IF(C13<>\"\",VLOOKUP($A13,'Öğrenci Listeleri'!B:F,3),\"\")","v":0},{"$f":"IF(C13<>\"\",VLOOKUP($A13,'Öğrenci Listeleri'!B:F,4),\"\")","v":0},{"$f":"IF(C13<>\"\",VLOOKUP($A13,'Öğrenci Listeleri'!B:F,5),\"\")","v":0}]
[12," ",{"$f":"IF(A14<>\"\",VLOOKUP($A14,'Öğrenci Listeleri'!B:F,2),\"\")","v":0},{"$f":"IF(C14<>\"\",VLOOKUP($A14,'Öğrenci Listeleri'!B:F,3),\"\")","v":0},{"$f":"IF(C14<>\"\",VLOOKUP($A14,'Öğrenci Listeleri'!B:F,4),\"\")","v":0},{"$f":"IF(C14<>\"\",VLOOKUP($A14,'Öğrenci Listeleri'!B:F,5),\"\")","v":0}]
[13," ",{"$f":"IF(A15<>\"\",VLOOKUP($A15,'Öğrenci Listeleri'!B:F,2),\"\")","v":0},{"$f":"IF(C15<>\"\",VLOOKUP($A15,'Öğrenci Listeleri'!B:F,3),\"\")","v":0},{"$f":"IF(C15<>\"\",VLOOKUP($A15,'Öğrenci Listeleri'!B:F,4),\"\")","v":0},{"$f":"IF(C15<>\"\",VLOOKUP($A15,'Öğrenci Listeleri'!B:F,5),\"\")","v":0}]
[14," ",{"$f":"IF(A16<>\"\",VLOOKUP($A16,'Öğrenci Listeleri'!B:F,2),\"\")","v":0},{"$f":"IF(C16<>\"\",VLOOKUP($A16,'Öğrenci Listeleri'!B:F,3),\"\")","v":0},{"$f":"IF(C16<>\"\",VLOOKUP($A16,'Öğrenci Listeleri'!B:F,4),\"\")","v":0},{"$f":"IF(C16<>\"\",VLOOKUP($A16,'Öğrenci Listeleri'!B:F,5),\"\")","v":0}]
[15," ",{"$f":"IF(A17<>\"\",VLOOKUP($A17,'Öğrenci Listeleri'!B:F,2),\"\")","v":0},{"$f":"IF(C17<>\"\",VLOOKUP($A17,'Öğrenci Listeleri'!B:F,3),\"\")","v":0},{"$f":"IF(C17<>\"\",VLOOKUP($A17,'Öğrenci Listeleri'!B:F,4),\"\")","v":0},{"$f":"IF(C17<>\"\",VLOOKUP($A17,'Öğrenci Listeleri'!B:F,5),\"\")","v":0}]
[16," ",{"$f":"IF(A18<>\"\",VLOOKUP($A18,'Öğrenci Listeleri'!B:F,2),\"\")","v":0},{"$f":"IF(C18<>\"\",VLOOKUP($A18,'Öğrenci Listeleri'!B:F,3),\"\")","v":0},{"$f":"IF(C18<>\"\",VLOOKUP($A18,'Öğrenci Listeleri'!B:F,4),\"\")","v":0},{"$f":"IF(C18<>\"\",VLOOKUP($A18,'Öğrenci Listeleri'!B:F,5),\"\")","v":0}]
[17," ",{"$f":"IF(A19<>\"\",VLOOKUP($A19,'Öğrenci Listeleri'!B:F,2),\"\")","v":0},{"$f":"IF(C19<>\"\",VLOOKUP($A19,'Öğrenci Listeleri'!B:F,3),\"\")","v":0},{"$f":"IF(C19<>\"\",VLOOKUP($A19,'Öğrenci Listeleri'!B:F,4),\"\")","v":0},{"$f":"IF(C19<>\"\",VLOOKUP($A19,'Öğrenci Listeleri'!B:F,5),\"\")","v":0}]
[18," ",{"$f":"IF(A20<>\"\",VLOOKUP($A20,'Öğrenci Listeleri'!B:F,2),\"\")","v":0},{"$f":"IF(C20<>\"\",VLOOKUP($A20,'Öğrenci Listeleri'!B:F,3),\"\")","v":0},{"$f":"IF(C20<>\"\",VLOOKUP($A20,'Öğrenci Listeleri'!B:F,4),\"\")","v":0},{"$f":"IF(C20<>\"\",VLOOKUP($A20,'Öğrenci Listeleri'!B:F,5),\"\")","v":0}]
[19," ",{"$f":"IF(A21<>\"\",VLOOKUP($A21,'Öğrenci Listeleri'!B:F,2),\"\")","v":0},{"$f":"IF(C21<>\"\",VLOOKUP($A21,'Öğrenci Listeleri'!B:F,3),\"\")","v":0},{"$f":"IF(C21<>\"\",VLOOKUP($A21,'Öğrenci Listeleri'!B:F,4),\"\")","v":0},{"$f":"IF(C21<>\"\",VLOOKUP($A21,'Öğrenci Listeleri'!B:F,5),\"\")","v":0}]
[20," ",{"$f":"IF(A22<>\"\",VLOOKUP($A22,'Öğrenci Listeleri'!B:F,2),\"\")","v":0},{"$f":"IF(C22<>\"\",VLOOKUP($A22,'Öğrenci Listeleri'!B:F,3),\"\")","v":0},{"$f":"IF(C22<>\"\",VLOOKUP($A22,'Öğrenci Listeleri'!B:F,4),\"\")","v":0},{"$f":"IF(C22<>\"\",VLOOKUP($A22,'Öğrenci Listeleri'!B:F,5),\"\")","v":0}]
[21," ",{"$f":"IF(A23<>\"\",VLOOKUP($A23,'Öğrenci Listeleri'!B:F,2),\"\")","v":0},{"$f":"IF(C23<>\"\",VLOOKUP($A23,'Öğrenci Listeleri'!B:F,3),\"\")","v":0},{"$f":"IF(C23<>\"\",VLOOKUP($A23,'Öğrenci Listeleri'!B:F,4),\"\")","v":0},{"$f":"IF(C23<>\"\",VLOOKUP($A23,'Öğrenci Listeleri'!B:F,5),\"\")","v":0}]
[22," ",{"$f":"IF(A24<>\"\",VLOOKUP($A24,'Öğrenci Listeleri'!B:F,2),\"\")","v":0},{"$f":"IF(C24<>\"\",VLOOKUP($A24,'Öğrenci Listeleri'!B:F,3),\"\")","v":0},{"$f":"IF(C24<>\"\",VLOOKUP($A24,'Öğrenci Listeleri'!B:F,4),\"\")","v":0},{"$f":"IF(C24<>\"\",VLOOKUP($A24,'Öğrenci Listeleri'!B:F,5),\"\")","v":0}]
[23," ",{"$f":"IF(A25<>\"\",VLOOKUP($A25,'Öğrenci Listeleri'!B:F,2),\"\")","v":0},{"$f":"IF(C25<>\"\",VLOOKUP($A25,'Öğrenci Listeleri'!B:F,3),\"\")","v":0},{"$f":"IF(C25<>\"\",VLOOKUP($A25,'Öğrenci Listeleri'!B:F,4),\"\")","v":0},{"$f":"IF(C25<>\"\",VLOOKUP($A25,'Öğrenci Listeleri'!B:F,5),\"\")","v":0}]
[24," ",{"$f":"IF(A26<>\"\",VLOOKUP($A26,'Öğrenci Listeleri'!B:F,2),\"\")","v":0},{"$f":"IF(C26<>\"\",VLOOKUP($A26,'Öğrenci Listeleri'!B:F,3),\"\")","v":0},{"$f":"IF(C26<>\"\",VLOOKUP($A26,'Öğrenci Listeleri'!B:F,4),\"\")","v":0},{"$f":"IF(C26<>\"\",VLOOKUP($A26,'Öğrenci Listeleri'!B:F,5),\"\")","v":0}]
[25," ",{"$f":"IF(A27<>\"\",VLOOKUP($A27,'Öğrenci Listeleri'!B:F,2),\"\")","v":0},{"$f":"IF(C27<>\"\",VLOOKUP($A27,'Öğrenci Listeleri'!B:F,3),\"\")","v":0},{"$f":"IF(C27<>\"\",VLOOKUP($A27,'Öğrenci Listeleri'!B:F,4),\"\")","v":0},{"$f":"IF(C27<>\"\",VLOOKUP($A27,'Öğrenci Listeleri'!B:F,5),\"\")","v":0}]
[26," ",{"$f":"IF(A28<>\"\",VLOOKUP($A28,'Öğrenci Listeleri'!B:F,2),\"\")","v":0},{"$f":"IF(C28<>\"\",VLOOKUP($A28,'Öğrenci Listeleri'!B:F,3),\"\")","v":0},{"$f":"IF(C28<>\"\",VLOOKUP($A28,'Öğrenci Listeleri'!B:F,4),\"\")","v":0},{"$f":"IF(C28<>\"\",VLOOKUP($A28,'Öğrenci Listeleri'!B:F,5),\"\")","v":0}]
[27," ",{"$f":"IF(A29<>\"\",VLOOKUP($A29,'Öğrenci Listeleri'!B:F,2),\"\")","v":0},{"$f":"IF(C29<>\"\",VLOOKUP($A29,'Öğrenci Listeleri'!B:F,3),\"\")","v":0},{"$f":"IF(C29<>\"\",VLOOKUP($A29,'Öğrenci Listeleri'!B:F,4),\"\")","v":0},{"$f":"IF(C29<>\"\",VLOOKUP($A29,'Öğrenci Listeleri'!B:F,5),\"\")","v":0}]
[28," ",{"$f":"IF(A30<>\"\",VLOOKUP($A30,'Öğrenci Listeleri'!B:F,2),\"\")","v":0},{"$f":"IF(C30<>\"\",VLOOKUP($A30,'Öğrenci Listeleri'!B:F,3),\"\")","v":0},{"$f":"IF(C30<>\"\",VLOOKUP($A30,'Öğrenci Listeleri'!B:F,4),\"\")","v":0},{"$f":"IF(C30<>\"\",VLOOKUP($A30,'Öğrenci Listeleri'!B:F,5),\"\")","v":0}]
[29," ",{"$f":"IF(A31<>\"\",VLOOKUP($A31,'Öğrenci Listeleri'!B:F,2),\"\")","v":0},{"$f":"IF(C31<>\"\",VLOOKUP($A31,'Öğrenci Listeleri'!B:F,3),\"\")","v":0},{"$f":"IF(C31<>\"\",VLOOKUP($A31,'Öğrenci Listeleri'!B:F,4),\"\")","v":0},{"$f":"IF(C31<>\"\",VLOOKUP($A31,'Öğrenci Listeleri'!B:F,5),\"\")","v":0}]
[30," ",{"$f":"IF(A32<>\"\",VLOOKUP($A32,'Öğrenci Listeleri'!B:F,2),\"\")","v":0},{"$f":"IF(C32<>\"\",VLOOKUP($A32,'Öğrenci Listeleri'!B:F,3),\"\")","v":0},{"$f":"IF(C32<>\"\",VLOOKUP($A32,'Öğrenci Listeleri'!B:F,4),\"\")","v":0},{"$f":"IF(C32<>\"\",VLOOKUP($A32,'Öğrenci Listeleri'!B:F,5),\"\")","v":0}]
[31," ",{"$f":"IF(A33<>\"\",VLOOKUP($A33,'Öğrenci Listeleri'!B:F,2),\"\")","v":0},{"$f":"IF(C33<>\"\",VLOOKUP($A33,'Öğrenci Listeleri'!B:F,3),\"\")","v":0},{"$f":"IF(C33<>\"\",VLOOKUP($A33,'Öğrenci Listeleri'!B:F,4),\"\")","v":0},{"$f":"IF(C33<>\"\",VLOOKUP($A33,'Öğrenci Listeleri'!B:F,5),\"\")","v":0}]
[32," ",{"$f":"IF(A34<>\"\",VLOOKUP($A34,'Öğrenci Listeleri'!B:F,2),\"\")","v":0},{"$f":"IF(C34<>\"\",VLOOKUP($A34,'Öğrenci Listeleri'!B:F,3),\"\")","v":0},{"$f":"IF(C34<>\"\",VLOOKUP($A34,'Öğrenci Listeleri'!B:F,4),\"\")","v":0},{"$f":"IF(C34<>\"\",VLOOKUP($A34,'Öğrenci Listeleri'!B:F,5),\"\")","v":0}]
[33," ",{"$f":"IF(A35<>\"\",VLOOKUP($A35,'Öğrenci Listeleri'!B:F,2),\"\")","v":0},{"$f":"IF(C35<>\"\",VLOOKUP($A35,'Öğrenci Listeleri'!B:F,3),\"\")","v":0},{"$f":"IF(C35<>\"\",VLOOKUP($A35,'Öğrenci Listeleri'!B:F,4),\"\")","v":0},{"$f":"IF(C35<>\"\",VLOOKUP($A35,'Öğrenci Listeleri'!B:F,5),\"\")","v":0}]
[34," ",{"$f":"IF(A36<>\"\",VLOOKUP($A36,'Öğrenci Listeleri'!B:F,2),\"\")","v":0},{"$f":"IF(C36<>\"\",VLOOKUP($A36,'Öğrenci Listeleri'!B:F,3),\"\")","v":0},{"$f":"IF(C36<>\"\",VLOOKUP($A36,'Öğrenci Listeleri'!B:F,4),\"\")","v":0},{"$f":"IF(C36<>\"\",VLOOKUP($A36,'Öğrenci Listeleri'!B:F,5),\"\")","v":0}]
[35," ",{"$f":"IF(A37<>\"\",VLOOKUP($A37,'Öğrenci Listeleri'!B:F,2),\"\")","v":0},{"$f":"IF(C37<>\"\",VLOOKUP($A37,'Öğrenci Listeleri'!B:F,3),\"\")","v":0},{"$f":"IF(C37<>\"\",VLOOKUP($A37,'Öğrenci Listeleri'!B:F,4),\"\")","v":0},{"$f":"IF(C37<>\"\",VLOOKUP($A37,'Öğrenci Listeleri'!B:F,5),\"\")","v":0}]
[36," ",{"$f":"IF(A38<>\"\",VLOOKUP($A38,'Öğrenci Listeleri'!B:F,2),\"\")","v":0},{"$f":"IF(C38<>\"\",VLOOKUP($A38,'Öğrenci Listeleri'!B:F,3),\"\")","v":0},{"$f":"IF(C38<>\"\",VLOOKUP($A38,'Öğrenci Listeleri'!B:F,4),\"\")","v":0},{"$f":"IF(C38<>\"\",VLOOKUP($A38,'Öğrenci Listeleri'!B:F,5),\"\")","v":0}]
[37," ",{"$f":"IF(A39<>\"\",VLOOKUP($A39,'Öğrenci Listeleri'!B:F,2),\"\")","v":0},{"$f":"IF(C39<>\"\",VLOOKUP($A39,'Öğrenci Listeleri'!B:F,3),\"\")","v":0},{"$f":"IF(C39<>\"\",VLOOKUP($A39,'Öğrenci Listeleri'!B:F,4),\"\")","v":0},{"$f":"IF(C39<>\"\",VLOOKUP($A39,'Öğrenci Listeleri'!B:F,5),\"\")","v":0}]
[38," ",{"$f":"IF(A40<>\"\",VLOOKUP($A40,'Öğrenci Listeleri'!B:F,2),\"\")","v":0},{"$f":"IF(C40<>\"\",VLOOKUP($A40,'Öğrenci Listeleri'!B:F,3),\"\")","v":0},{"$f":"IF(C40<>\"\",VLOOKUP($A40,'Öğrenci Listeleri'!B:F,4),\"\")","v":0},{"$f":"IF(C40<>\"\",VLOOKUP($A40,'Öğrenci Listeleri'!B:F,5),\"\")","v":0}]
[39," ",{"$f":"IF(A41<>\"\",VLOOKUP($A41,'Öğrenci Listeleri'!B:F,2),\"\")","v":0},{"$f":"IF(C41<>\"\",VLOOKUP($A41,'Öğrenci Listeleri'!B:F,3),\"\")","v":0},{"$f":"IF(C41<>\"\",VLOOKUP($A41,'Öğrenci Listeleri'!B:F,4),\"\")","v":0},{"$f":"IF(C41<>\"\",VLOOKUP($A41,'Öğrenci Listeleri'!B:F,5),\"\")","v":0}]
[40," ",{"$f":"IF(A42<>\"\",VLOOKUP($A42,'Öğrenci Listeleri'!B:F,2),\"\")","v":0},{"$f":"IF(C42<>\"\",VLOOKUP($A42,'Öğrenci Listeleri'!B:F,3),\"\")","v":0},{"$f":"IF(C42<>\"\",VLOOKUP($A42,'Öğrenci Listeleri'!B:F,4),\"\")","v":0},{"$f":"IF(C42<>\"\",VLOOKUP($A42,'Öğrenci Listeleri'!B:F,5),\"\")","v":0}]

{"sheet":"Kaynaklarımız","index":4,"n_rows":28,"n_cols":5,"rows_kept":28,"cut":false,"hidden":false,"merged":[]}
[]
[null,"SIRA NO","ÖĞRETMENLER","BRANŞLAR","EĞİTİM-ÖĞRETİM YILI"]
[null,1,"EBRU BUSE GÜDER","İNGİLİZCE","2017/2018"]
[null,2,"DÖNDÜ ÜNAL","MATEMATİK","2017/2018"]
[null,3,"GÖKHAN EKER","TARİH","2017/2018"]
[null,4,"METİN ÖNDER","İHL MESLEK DERSLERİ","2017/2018"]
[null,5,"LEVENT DEMİR","İHL MESLEK DERSLERİ","2017/2018"]
[null,6,"HÜRKAN METE","İHL MESLEK DERSLERİ","2017/2018"]
[null,7,"AHMET FURKAN GÜNEŞ","İHL MESLEK DERSLERİ","2017/2018"]
[null,8,"ESRA KAYAR","FİZİK","2017/2018"]
[null,9,"SEHURE CAN","MATEMATİK","2017/2018"]
[null,10,"FATİH ÇALHAN","COĞRAFYA","2017/2018"]
[null,11,"BİRGÜL IRMAK","TÜRK DİLİ VE EDEBİYATI","2017/2018"]
[null,12,"MUHAMMET YILMAZ","TÜRK DİLİ VE EDEBİYATI","2017/2018"]
[null,13,"SEHURE CAN","KİMYA","2017/2018"]
[null,14,"ABDULLAH ŞENGÖNÜL","BEDEN EĞİTİMİ","2017/2018"]
[null,15,"FATMA ÇAKMAK","GÖRSEL SANATLAR","2017/2018"]
[null,16]
[null,17]
[null,18]
[null,19]
[null,20]
[null,21]
[null,22]
[null,23]
[null,24]
[null,25]
[null,26]